{"text_format":"1","workbook":"xlsx","n_sheets":19,"sheets":["Úvod","Start","Kontakt","ZPV","V.l.ZPV","PJ-S","PJ-V","PJ - P","PJ-P","DV-S","DV-V","DV - P","DV-P","TEST","Výsledky","Tisk-v1","Tisk-v2","Pozn.","List1"],"not_rendered":{"charts":0,"images":0,"macros":1,"external_links":0,"defined_names":15,"comments":1,"pivot_tables":0},"unopened":[],"bounds":{"document_bytes":16777216,"sheet_cells":100000,"rows_first":2000,"rows_last":500,"rows_between":2000,"halvings":0,"cell_chars":16384,"cell_head_chars":4096},"cells_cut":0,"cells_raw":0,"read":"whole","date_system":"1900"}

{"sheet":"Úvod","index":0,"n_rows":25,"n_cols":14,"rows_kept":25,"cut":false,"hidden":false,"merged":[[0,1,0,9],[1,1,1,9]]}
[null,"Program pro zpracování výsledků ",null,null,null,null,null,null,null,null,null,1,1,1]
[null,"DOROST - JEDNOTLIVCI"]
[]
[]
[]
[]
[]
[]
[]
[]
[]
[]
[]
[]
[]
[]
[]
[]
[]
[]
[]
[]
[null,"Autor programu:",null,"Ing. Milan Hoffmann"]
[null,"Oprávněný uživatel:",null,"SH ČMS"]
[null,"Verze programu:",null,"2011/1 (11.02.2011)"]

{"sheet":"Start","index":1,"n_rows":56,"n_cols":6,"rows_kept":56,"cut":false,"hidden":false,"merged":[[0,1,0,6],[1,1,1,6],[2,1,2,6],[4,3,4,5]]}
[null,"Startovní listina soutěže"]
[null,"Krajské kolo soutěží dorostu"]
[null,"19. června 2021 Tachov"]
[]
[null,null,"Kat.:","Dorky - Střední"]
[null,null,"st.č.","Jméno","SDH","Okres"]
[null,null,1,"Klára Trmotová","Dlažov","KT"]
[null,null,2,"Tereza Grünerová ","Brod nad Tichou","TA"]
[null,null,3,"Iva Babková","Bystřice nad Úhlavou","KT"]
[null,null,4,"Michaela Marešová","Planá","TA"]
[null,null,5,"Adéla Stodolová","Planá","TA"]
[null,null,6]
[null,null,7]
[null,null,8]
[null,null,9]
[null,null,10]
[null,null,11]
[null,null,12]
[null,null,13]
[null,null,14]
[null,null,15]
[null,null,16]
[null,null,17]
[null,null,18]
[null,null,19]
[null,null,20]
[null,null,21]
[null,null,22]
[null,null,23]
[null,null,24]
[null,null,25]
[null,null,26]
[null,null,27]
[null,null,28]
[null,null,29]
[null,null,30]
[null,null,31]
[null,null,32]
[null,null,33]
[null,null,34]
[null,null,35]
[null,null,36]
[null,null,37]
[null,null,38]
[null,null,39]
[null,null,40]
[null,null,41]
[null,null,42]
[null,null,43]
[null,null,44]
[null,null,45]
[null,null,46]
[null,null,47]
[null,null,48]
[null,null,49]
[null,null,50]

{"sheet":"Kontakt","index":2,"n_rows":15,"n_cols":3,"rows_kept":15,"cut":false,"hidden":false,"merged":[[0,1,0,14]]}
[null,"Kontakt"]
[]
[null,"Program na zpracování výsledků (DOROST - Jednotlivci) pro SH ČMS vytvořil:"]
[]
[null,"Ing. Milan HOFFMANN"]
[null,"Vojanova 760/49"]
[null,"318 00 PLZEŇ"]
[]
[null,"tel.:","+420 373 540 062"]
[null,"mobil:","+420 606 916 333"]
[null,null,"+420 731 428 398"]
[]
[null,"mail:","milan.hoffmann@seznam.cz"]
[]
[null,"www:","www.dh.cz"]

{"sheet":"ZPV","index":3,"n_rows":55,"n_cols":23,"rows_kept":55,"cut":false,"hidden":false,"merged":[[0,1,0,21],[2,2,2,4],[3,1,4,1],[3,5,4,5],[3,6,4,6],[3,7,4,7],[3,8,4,8],[3,9,4,9],[3,10,3,13],[3,14,3,21],[3,2,4,2],[3,3,4,3],[3,4,4,4]]}
[null," Závod požárnické všestrannosti: DOROST - JEDNOTLIVCI"]
[]
[null,null,{"$f":"Start!$D$5","v":"Dorky - Střední"}]
[null,"Startovní číslo","Jméno ","SDH",{"$f":"Start!$F$6","v":"Okres"}," čas startu (hh:mm:ss)"," čas cíle (hh:mm:ss)"," čistý čas na trati (mm:ss)","čekací čas (mm:ss)","výsledný čas na trati (mm:ss)","Výsledky soutěže",null,null,null,"tresný bod = 1 minuta "]
[null,null,null,null,null,null,null,null,null,null," trestné minuty (h:mm)"," výsledný čas (h:mm:ss)"," počet bodů za umístění"," součet tresných bodů"," přesun podle azimutu"," střelba ze vzduchovky"," šplh"," přeskok přes vodní příkop"," určování RHP"," určování věcných prostředků"," optická signalizace"," první pomoc","diskvalifikace (D)"]
[null,1,{"$f":"IF(Start!D7=\"\",\"\",Start!D7)","v":"Klára Trmotová"},{"$f":"IF(Start!E7=\"\",\"\",Start!E7)","v":"Dlažov"},{"$f":"IF(C6=\"\",\"\",IF(Start!F7=\"\",\"\",Start!F7))","v":"KT"},null,null,{"$f":"IF(C6=\"\",\"\",IF(G6>0,IF(AND(F6>0,G6>0,(G6-F6)>0),G6-F6,\"chyba\"),\"X\"))","v":"X"},{"$f":"IF(C6=\"\",\"\",0)","v":"00:00:00"},{"$f":"IF(C6=\"\",\"\",IF(H6=\"chyba\",\"chyba\",IF(H6=\"X\",\"X\",IF((H6-I6)<0,\"chyba\",H6-I6))))","v":"X"},{"$f":"IF(C6=\"\",\"\",N6/1440)","v":"00:00:00"},{"$f":"IF(C6=\"\",\"\",IF(J6=\"chyba\",\"chyba\",IF(J6=\"X\",\"X\",IF(OR(O6=\"D\",W6=\"D\"),\"D\",ROUND(SUM(J6:K6),7)))))","v":"X"},{"$f":"IF(C6=\"\",\"\",IF(L6=\"chyba\",\"CH\",IF(L6=\"X\",\"X\",IF(L6=\"D\",\"D\",RANK(L6,L$6:L$55,1)))))","v":"X"},{"$f":"IF(C6=\"\",\"\",SUM(O6:V6))","v":0}]
[null,2,{"$f":"IF(Start!D8=\"\",\"\",Start!D8)","v":"Tereza Grünerová "},{"$f":"IF(Start!E8=\"\",\"\",Start!E8)","v":"Brod nad Tichou"},{"$f":"IF(C7=\"\",\"\",IF(Start!F8=\"\",\"\",Start!F8))","v":"TA"},null,null,{"$f":"IF(C7=\"\",\"\",IF(G7>0,IF(AND(F7>0,G7>0,(G7-F7)>0),G7-F7,\"chyba\"),\"X\"))","v":"X"},{"$f":"IF(C7=\"\",\"\",0)","v":"00:00:00"},{"$f":"IF(C7=\"\",\"\",IF(H7=\"chyba\",\"chyba\",IF(H7=\"X\",\"X\",IF((H7-I7)<0,\"chyba\",H7-I7))))","v":"X"},{"$f":"IF(C7=\"\",\"\",N7/1440)","v":"00:00:00"},{"$f":"IF(C7=\"\",\"\",IF(J7=\"chyba\",\"chyba\",IF(J7=\"X\",\"X\",IF(OR(O7=\"D\",W7=\"D\"),\"D\",ROUND(SUM(J7:K7),7)))))","v":"X"},{"$f":"IF(C7=\"\",\"\",IF(L7=\"chyba\",\"CH\",IF(L7=\"X\",\"X\",IF(L7=\"D\",\"D\",RANK(L7,L$6:L$55,1)))))","v":"X"},{"$f":"IF(C7=\"\",\"\",SUM(O7:V7))","v":0}]
[null,3,{"$f":"IF(Start!D9=\"\",\"\",Start!D9)","v":"Iva Babková"},{"$f":"IF(Start!E9=\"\",\"\",Start!E9)","v":"Bystřice nad Úhlavou"},{"$f":"IF(C8=\"\",\"\",IF(Start!F9=\"\",\"\",Start!F9))","v":"KT"},null,null,"X","00:00:00","X","00:00:00","X","X",0]
[null,4,{"$f":"IF(Start!D10=\"\",\"\",Start!D10)","v":"Michaela Marešová"},{"$f":"IF(Start!E10=\"\",\"\",Start!E10)","v":"Planá"},{"$f":"IF(C9=\"\",\"\",IF(Start!F10=\"\",\"\",Start!F10))","v":"TA"},null,null,"X","00:00:00","X","00:00:00","X","X",0]
[null,5,{"$f":"IF(Start!D11=\"\",\"\",Start!D11)","v":"Adéla Stodolová"},{"$f":"IF(Start!E11=\"\",\"\",Start!E11)","v":"Planá"},{"$f":"IF(C10=\"\",\"\",IF(Start!F11=\"\",\"\",Start!F11))","v":"TA"},null,null,"X","00:00:00","X","00:00:00","X","X",0]
[null,6,{"$f":"IF(Start!D12=\"\",\"\",Start!D12)","v":""},{"$f":"IF(Start!E12=\"\",\"\",Start!E12)","v":""},{"$f":"IF(C11=\"\",\"\",IF(Start!F12=\"\",\"\",Start!F12))","v":""},null,null,"","","","","","",""]
[null,7,{"$f":"IF(Start!D13=\"\",\"\",Start!D13)","v":""},{"$f":"IF(Start!E13=\"\",\"\",Start!E13)","v":""},{"$f":"IF(C12=\"\",\"\",IF(Start!F13=\"\",\"\",Start!F13))","v":""},null,null,"","","","","","",""]
[null,8,{"$f":"IF(Start!D14=\"\",\"\",Start!D14)","v":""},{"$f":"IF(Start!E14=\"\",\"\",Start!E14)","v":""},{"$f":"IF(C13=\"\",\"\",IF(Start!F14=\"\",\"\",Start!F14))","v":""},null,null,"","","","","","",""]
[null,9,{"$f":"IF(Start!D15=\"\",\"\",Start!D15)","v":""},{"$f":"IF(Start!E15=\"\",\"\",Start!E15)","v":""},{"$f":"IF(C14=\"\",\"\",IF(Start!F15=\"\",\"\",Start!F15))","v":""},null,null,"","","","","","",""]
[null,10,{"$f":"IF(Start!D16=\"\",\"\",Start!D16)","v":""},{"$f":"IF(Start!E16=\"\",\"\",Start!E16)","v":""},{"$f":"IF(C15=\"\",\"\",IF(Start!F16=\"\",\"\",Start!F16))","v":""},null,null,"","","","","","",""]
[null,11,{"$f":"IF(Start!D17=\"\",\"\",Start!D17)","v":""},{"$f":"IF(Start!E17=\"\",\"\",Start!E17)","v":""},{"$f":"IF(C16=\"\",\"\",IF(Start!F17=\"\",\"\",Start!F17))","v":""},null,null,"","","","","","",""]
[null,12,{"$f":"IF(Start!D18=\"\",\"\",Start!D18)","v":""},{"$f":"IF(Start!E18=\"\",\"\",Start!E18)","v":""},{"$f":"IF(C17=\"\",\"\",IF(Start!F18=\"\",\"\",Start!F18))","v":""},null,null,"","","","","","",""]
[null,13,{"$f":"IF(Start!D19=\"\",\"\",Start!D19)","v":""},{"$f":"IF(Start!E19=\"\",\"\",Start!E19)","v":""},{"$f":"IF(C18=\"\",\"\",IF(Start!F19=\"\",\"\",Start!F19))","v":""},null,null,"","","","","","",""]
[null,14,{"$f":"IF(Start!D20=\"\",\"\",Start!D20)","v":""},{"$f":"IF(Start!E20=\"\",\"\",Start!E20)","v":""},{"$f":"IF(C19=\"\",\"\",IF(Start!F20=\"\",\"\",Start!F20))","v":""},null,null,"","","","","","",""]
[null,15,{"$f":"IF(Start!D21=\"\",\"\",Start!D21)","v":""},{"$f":"IF(Start!E21=\"\",\"\",Start!E21)","v":""},{"$f":"IF(C20=\"\",\"\",IF(Start!F21=\"\",\"\",Start!F21))","v":""},null,null,"","","","","","",""]
[null,16,{"$f":"IF(Start!D22=\"\",\"\",Start!D22)","v":""},{"$f":"IF(Start!E22=\"\",\"\",Start!E22)","v":""},{"$f":"IF(C21=\"\",\"\",IF(Start!F22=\"\",\"\",Start!F22))","v":""},null,null,"","","","","","",""]
[null,17,{"$f":"IF(Start!D23=\"\",\"\",Start!D23)","v":""},{"$f":"IF(Start!E23=\"\",\"\",Start!E23)","v":""},{"$f":"IF(C22=\"\",\"\",IF(Start!F23=\"\",\"\",Start!F23))","v":""},null,null,"","","","","","",""]
[null,18,{"$f":"IF(Start!D24=\"\",\"\",Start!D24)","v":""},{"$f":"IF(Start!E24=\"\",\"\",Start!E24)","v":""},{"$f":"IF(C23=\"\",\"\",IF(Start!F24=\"\",\"\",Start!F24))","v":""},null,null,"","","","","","",""]
[null,19,{"$f":"IF(Start!D25=\"\",\"\",Start!D25)","v":""},{"$f":"IF(Start!E25=\"\",\"\",Start!E25)","v":""},{"$f":"IF(C24=\"\",\"\",IF(Start!F25=\"\",\"\",Start!F25))","v":""},null,null,"","","","","","",""]
[null,20,{"$f":"IF(Start!D26=\"\",\"\",Start!D26)","v":""},{"$f":"IF(Start!E26=\"\",\"\",Start!E26)","v":""},{"$f":"IF(C25=\"\",\"\",IF(Start!F26=\"\",\"\",Start!F26))","v":""},null,null,"","","","","","",""]
[null,21,{"$f":"IF(Start!D27=\"\",\"\",Start!D27)","v":""},{"$f":"IF(Start!E27=\"\",\"\",Start!E27)","v":""},{"$f":"IF(C26=\"\",\"\",IF(Start!F27=\"\",\"\",Start!F27))","v":""},null,null,"","","","","","",""]
[null,22,{"$f":"IF(Start!D28=\"\",\"\",Start!D28)","v":""},{"$f":"IF(Start!E28=\"\",\"\",Start!E28)","v":""},{"$f":"IF(C27=\"\",\"\",IF(Start!F28=\"\",\"\",Start!F28))","v":""},null,null,"","","","","","",""]
[null,23,{"$f":"IF(Start!D29=\"\",\"\",Start!D29)","v":""},{"$f":"IF(Start!E29=\"\",\"\",Start!E29)","v":""},{"$f":"IF(C28=\"\",\"\",IF(Start!F29=\"\",\"\",Start!F29))","v":""},null,null,"","","","","","",""]
[null,24,{"$f":"IF(Start!D30=\"\",\"\",Start!D30)","v":""},{"$f":"IF(Start!E30=\"\",\"\",Start!E30)","v":""},{"$f":"IF(C29=\"\",\"\",IF(Start!F30=\"\",\"\",Start!F30))","v":""},null,null,"","","","","","",""]
[null,25,{"$f":"IF(Start!D31=\"\",\"\",Start!D31)","v":""},{"$f":"IF(Start!E31=\"\",\"\",Start!E31)","v":""},{"$f":"IF(C30=\"\",\"\",IF(Start!F31=\"\",\"\",Start!F31))","v":""},null,null,"","","","","","",""]
[null,26,{"$f":"IF(Start!D32=\"\",\"\",Start!D32)","v":""},{"$f":"IF(Start!E32=\"\",\"\",Start!E32)","v":""},{"$f":"IF(C31=\"\",\"\",IF(Start!F32=\"\",\"\",Start!F32))","v":""},null,null,"","","","","","",""]
[null,27,{"$f":"IF(Start!D33=\"\",\"\",Start!D33)","v":""},{"$f":"IF(Start!E33=\"\",\"\",Start!E33)","v":""},{"$f":"IF(C32=\"\",\"\",IF(Start!F33=\"\",\"\",Start!F33))","v":""},null,null,"","","","","","",""]
[null,28,{"$f":"IF(Start!D34=\"\",\"\",Start!D34)","v":""},{"$f":"IF(Start!E34=\"\",\"\",Start!E34)","v":""},{"$f":"IF(C33=\"\",\"\",IF(Start!F34=\"\",\"\",Start!F34))","v":""},null,null,"","","","","","",""]
[null,29,{"$f":"IF(Start!D35=\"\",\"\",Start!D35)","v":""},{"$f":"IF(Start!E35=\"\",\"\",Start!E35)","v":""},{"$f":"IF(C34=\"\",\"\",IF(Start!F35=\"\",\"\",Start!F35))","v":""},null,null,"","","","","","",""]
[null,30,{"$f":"IF(Start!D36=\"\",\"\",Start!D36)","v":""},{"$f":"IF(Start!E36=\"\",\"\",Start!E36)","v":""},{"$f":"IF(C35=\"\",\"\",IF(Start!F36=\"\",\"\",Start!F36))","v":""},null,null,"","","","","","",""]
[null,31,{"$f":"IF(Start!D37=\"\",\"\",Start!D37)","v":""},{"$f":"IF(Start!E37=\"\",\"\",Start!E37)","v":""},{"$f":"IF(C36=\"\",\"\",IF(Start!F37=\"\",\"\",Start!F37))","v":""},null,null,"","","","","","",""]
[null,32,{"$f":"IF(Start!D38=\"\",\"\",Start!D38)","v":""},{"$f":"IF(Start!E38=\"\",\"\",Start!E38)","v":""},{"$f":"IF(C37=\"\",\"\",IF(Start!F38=\"\",\"\",Start!F38))","v":""},null,null,"","","","","","",""]
[null,33,{"$f":"IF(Start!D39=\"\",\"\",Start!D39)","v":""},{"$f":"IF(Start!E39=\"\",\"\",Start!E39)","v":""},{"$f":"IF(C38=\"\",\"\",IF(Start!F39=\"\",\"\",Start!F39))","v":""},null,null,"","","","","","",""]
[null,34,{"$f":"IF(Start!D40=\"\",\"\",Start!D40)","v":""},{"$f":"IF(Start!E40=\"\",\"\",Start!E40)","v":""},{"$f":"IF(C39=\"\",\"\",IF(Start!F40=\"\",\"\",Start!F40))","v":""},null,null,"","","","","","",""]
[null,35,{"$f":"IF(Start!D41=\"\",\"\",Start!D41)","v":""},{"$f":"IF(Start!E41=\"\",\"\",Start!E41)","v":""},{"$f":"IF(C40=\"\",\"\",IF(Start!F41=\"\",\"\",Start!F41))","v":""},null,null,"","","","","","",""]
[null,36,{"$f":"IF(Start!D42=\"\",\"\",Start!D42)","v":""},{"$f":"IF(Start!E42=\"\",\"\",Start!E42)","v":""},{"$f":"IF(C41=\"\",\"\",IF(Start!F42=\"\",\"\",Start!F42))","v":""},null,null,"","","","","","",""]
[null,37,{"$f":"IF(Start!D43=\"\",\"\",Start!D43)","v":""},{"$f":"IF(Start!E43=\"\",\"\",Start!E43)","v":""},{"$f":"IF(C42=\"\",\"\",IF(Start!F43=\"\",\"\",Start!F43))","v":""},null,null,"","","","","","",""]
[null,38,{"$f":"IF(Start!D44=\"\",\"\",Start!D44)","v":""},{"$f":"IF(Start!E44=\"\",\"\",Start!E44)","v":""},{"$f":"IF(C43=\"\",\"\",IF(Start!F44=\"\",\"\",Start!F44))","v":""},null,null,"","","","","","",""]
[null,39,{"$f":"IF(Start!D45=\"\",\"\",Start!D45)","v":""},{"$f":"IF(Start!E45=\"\",\"\",Start!E45)","v":""},{"$f":"IF(C44=\"\",\"\",IF(Start!F45=\"\",\"\",Start!F45))","v":""},null,null,"","","","","","",""]
[null,40,{"$f":"IF(Start!D46=\"\",\"\",Start!D46)","v":""},{"$f":"IF(Start!E46=\"\",\"\",Start!E46)","v":""},{"$f":"IF(C45=\"\",\"\",IF(Start!F46=\"\",\"\",Start!F46))","v":""},null,null,"","","","","","",""]
[null,41,{"$f":"IF(Start!D47=\"\",\"\",Start!D47)","v":""},{"$f":"IF(Start!E47=\"\",\"\",Start!E47)","v":""},{"$f":"IF(C46=\"\",\"\",IF(Start!F47=\"\",\"\",Start!F47))","v":""},null,null,"","","","","","",""]
[null,42,{"$f":"IF(Start!D48=\"\",\"\",Start!D48)","v":""},{"$f":"IF(Start!E48=\"\",\"\",Start!E48)","v":""},{"$f":"IF(C47=\"\",\"\",IF(Start!F48=\"\",\"\",Start!F48))","v":""},null,null,"","","","","","",""]
[null,43,{"$f":"IF(Start!D49=\"\",\"\",Start!D49)","v":""},{"$f":"IF(Start!E49=\"\",\"\",Start!E49)","v":""},{"$f":"IF(C48=\"\",\"\",IF(Start!F49=\"\",\"\",Start!F49))","v":""},null,null,"","","","","","",""]
[null,44,{"$f":"IF(Start!D50=\"\",\"\",Start!D50)","v":""},{"$f":"IF(Start!E50=\"\",\"\",Start!E50)","v":""},{"$f":"IF(C49=\"\",\"\",IF(Start!F50=\"\",\"\",Start!F50))","v":""},null,null,"","","","","","",""]
[null,45,{"$f":"IF(Start!D51=\"\",\"\",Start!D51)","v":""},{"$f":"IF(Start!E51=\"\",\"\",Start!E51)","v":""},{"$f":"IF(C50=\"\",\"\",IF(Start!F51=\"\",\"\",Start!F51))","v":""},null,null,"","","","","","",""]
[null,46,{"$f":"IF(Start!D52=\"\",\"\",Start!D52)","v":""},{"$f":"IF(Start!E52=\"\",\"\",Start!E52)","v":""},{"$f":"IF(C51=\"\",\"\",IF(Start!F52=\"\",\"\",Start!F52))","v":""},null,null,"","","","","","",""]
[null,47,{"$f":"IF(Start!D53=\"\",\"\",Start!D53)","v":""},{"$f":"IF(Start!E53=\"\",\"\",Start!E53)","v":""},{"$f":"IF(C52=\"\",\"\",IF(Start!F53=\"\",\"\",Start!F53))","v":""},null,null,"","","","","","",""]
[null,48,{"$f":"IF(Start!D54=\"\",\"\",Start!D54)","v":""},{"$f":"IF(Start!E54=\"\",\"\",Start!E54)","v":""},{"$f":"IF(C53=\"\",\"\",IF(Start!F54=\"\",\"\",Start!F54))","v":""},null,null,"","","","","","",""]
[null,49,{"$f":"IF(Start!D55=\"\",\"\",Start!D55)","v":""},{"$f":"IF(Start!E55=\"\",\"\",Start!E55)","v":""},{"$f":"IF(C54=\"\",\"\",IF(Start!F55=\"\",\"\",Start!F55))","v":""},null,null,"","","","","","",""]
[null,50,{"$f":"IF(Start!D56=\"\",\"\",Start!D56)","v":""},{"$f":"IF(Start!E56=\"\",\"\",Start!E56)","v":""},{"$f":"IF(C55=\"\",\"\",IF(Start!F56=\"\",\"\",Start!F56))","v":""},null,null,"","","","","","",""]

{"sheet":"V.l.ZPV","index":4,"n_rows":6,"n_cols":7,"rows_kept":6,"cut":false,"hidden":false,"merged":[[0,1,0,5],[3,3,3,5],[2,3,2,5]]}
[null,"Výsledková listina - ZPV"]
[]
[null,null,null,"Jednotlivci"]
[null,null,null,{"$f":"Start!$D$5","v":"Dorky - Střední"}]
[null,null,"Pořadí","Jméno","SDH",{"$f":"Start!$F$6","v":"Okres"}]
[null,null,null,null,null,null,"."]

{"sheet":"PJ-S","index":5,"n_rows":54,"n_cols":16,"rows_kept":54,"cut":false,"hidden":false,"merged":[[0,1,0,15],[2,5,2,8],[2,11,2,14]]}
[null,"Běh na 100m s překážkami - J - Startovní listina"]
[]
[null,null,{"$f":"Start!$D$5","v":"Dorky - Střední"},null,null,"I. pokus",null,null,null,null,null,"II. pokus"]
[null,"st.č.","Jméno","SDH",{"$f":"Start!$F$6","v":"Okres"},1,2,3,"Čas","dr.",null,1,2,3,"Čas","dr."]
[null,"1",{"$f":"IF(Start!D7=\"\",\"\",Start!D7)","v":"Klára Trmotová"},{"$f":"IF(Start!E7=\"\",\"\",Start!E7)","v":"Dlažov"},{"$f":"IF(Start!F7=\"\",\"\",Start!F7)","v":"KT"},null,null,null,null,"1",null,null,null,null,null,"2"]
[null,"2",{"$f":"IF(Start!D8=\"\",\"\",Start!D8)","v":"Tereza Grünerová "},{"$f":"IF(Start!E8=\"\",\"\",Start!E8)","v":"Brod nad Tichou"},{"$f":"IF(Start!F8=\"\",\"\",Start!F8)","v":"TA"},null,null,null,null,"2",null,null,null,null,null,"1"]
[null,"3",{"$f":"IF(Start!D9=\"\",\"\",Start!D9)","v":"Iva Babková"},{"$f":"IF(Start!E9=\"\",\"\",Start!E9)","v":"Bystřice nad Úhlavou"},{"$f":"IF(Start!F9=\"\",\"\",Start!F9)","v":"KT"},null,null,null,null,"1",null,null,null,null,null,"2"]
[null,"4",{"$f":"IF(Start!D10=\"\",\"\",Start!D10)","v":"Michaela Marešová"},{"$f":"IF(Start!E10=\"\",\"\",Start!E10)","v":"Planá"},{"$f":"IF(Start!F10=\"\",\"\",Start!F10)","v":"TA"},null,null,null,null,"2",null,null,null,null,null,"1"]
[null,"5",{"$f":"IF(Start!D11=\"\",\"\",Start!D11)","v":"Adéla Stodolová"},{"$f":"IF(Start!E11=\"\",\"\",Start!E11)","v":"Planá"},{"$f":"IF(Start!F11=\"\",\"\",Start!F11)","v":"TA"},null,null,null,null,"1",null,null,null,null,null,"2"]
[null,"6",{"$f":"IF(Start!D12=\"\",\"\",Start!D12)","v":""},{"$f":"IF(Start!E12=\"\",\"\",Start!E12)","v":""},{"$f":"IF(Start!F12=\"\",\"\",Start!F12)","v":""},null,null,null,null,"2",null,null,null,null,null,"1"]
[null,"7",{"$f":"IF(Start!D13=\"\",\"\",Start!D13)","v":""},{"$f":"IF(Start!E13=\"\",\"\",Start!E13)","v":""},{"$f":"IF(Start!F13=\"\",\"\",Start!F13)","v":""},null,null,null,null,"1",null,null,null,null,null,"2"]
[null,"8",{"$f":"IF(Start!D14=\"\",\"\",Start!D14)","v":""},{"$f":"IF(Start!E14=\"\",\"\",Start!E14)","v":""},{"$f":"IF(Start!F14=\"\",\"\",Start!F14)","v":""},null,null,null,null,"2",null,null,null,null,null,"1"]
[null,"9",{"$f":"IF(Start!D15=\"\",\"\",Start!D15)","v":""},{"$f":"IF(Start!E15=\"\",\"\",Start!E15)","v":""},{"$f":"IF(Start!F15=\"\",\"\",Start!F15)","v":""},null,null,null,null,"1",null,null,null,null,null,"2"]
[null,"10",{"$f":"IF(Start!D16=\"\",\"\",Start!D16)","v":""},{"$f":"IF(Start!E16=\"\",\"\",Start!E16)","v":""},{"$f":"IF(Start!F16=\"\",\"\",Start!F16)","v":""},null,null,null,null,"2",null,null,null,null,null,"1"]
[null,"11",{"$f":"IF(Start!D17=\"\",\"\",Start!D17)","v":""},{"$f":"IF(Start!E17=\"\",\"\",Start!E17)","v":""},{"$f":"IF(Start!F17=\"\",\"\",Start!F17)","v":""},null,null,null,null,"1",null,null,null,null,null,"2"]
[null,"12",{"$f":"IF(Start!D18=\"\",\"\",Start!D18)","v":""},{"$f":"IF(Start!E18=\"\",\"\",Start!E18)","v":""},{"$f":"IF(Start!F18=\"\",\"\",Start!F18)","v":""},null,null,null,null,"2",null,null,null,null,null,"1"]
[null,"13",{"$f":"IF(Start!D19=\"\",\"\",Start!D19)","v":""},{"$f":"IF(Start!E19=\"\",\"\",Start!E19)","v":""},{"$f":"IF(Start!F19=\"\",\"\",Start!F19)","v":""},null,null,null,null,"1",null,null,null,null,null,"2"]
[null,"14",{"$f":"IF(Start!D20=\"\",\"\",Start!D20)","v":""},{"$f":"IF(Start!E20=\"\",\"\",Start!E20)","v":""},{"$f":"IF(Start!F20=\"\",\"\",Start!F20)","v":""},null,null,null,null,"2",null,null,null,null,null,"1"]
[null,"15",{"$f":"IF(Start!D21=\"\",\"\",Start!D21)","v":""},{"$f":"IF(Start!E21=\"\",\"\",Start!E21)","v":""},{"$f":"IF(Start!F21=\"\",\"\",Start!F21)","v":""},null,null,null,null,"1",null,null,null,null,null,"2"]
[null,"16",{"$f":"IF(Start!D22=\"\",\"\",Start!D22)","v":""},{"$f":"IF(Start!E22=\"\",\"\",Start!E22)","v":""},{"$f":"IF(Start!F22=\"\",\"\",Start!F22)","v":""},null,null,null,null,"2",null,null,null,null,null,"1"]
[null,"17",{"$f":"IF(Start!D23=\"\",\"\",Start!D23)","v":""},{"$f":"IF(Start!E23=\"\",\"\",Start!E23)","v":""},{"$f":"IF(Start!F23=\"\",\"\",Start!F23)","v":""},null,null,null,null,"1",null,null,null,null,null,"2"]
[null,"18",{"$f":"IF(Start!D24=\"\",\"\",Start!D24)","v":""},{"$f":"IF(Start!E24=\"\",\"\",Start!E24)","v":""},{"$f":"IF(Start!F24=\"\",\"\",Start!F24)","v":""},null,null,null,null,"2",null,null,null,null,null,"1"]
[null,"19",{"$f":"IF(Start!D25=\"\",\"\",Start!D25)","v":""},{"$f":"IF(Start!E25=\"\",\"\",Start!E25)","v":""},{"$f":"IF(Start!F25=\"\",\"\",Start!F25)","v":""},null,null,null,null,"1",null,null,null,null,null,"2"]
[null,"20",{"$f":"IF(Start!D26=\"\",\"\",Start!D26)","v":""},{"$f":"IF(Start!E26=\"\",\"\",Start!E26)","v":""},{"$f":"IF(Start!F26=\"\",\"\",Start!F26)","v":""},null,null,null,null,"2",null,null,null,null,null,"1"]
[null,"21",{"$f":"IF(Start!D27=\"\",\"\",Start!D27)","v":""},{"$f":"IF(Start!E27=\"\",\"\",Start!E27)","v":""},{"$f":"IF(Start!F27=\"\",\"\",Start!F27)","v":""},null,null,null,null,"1",null,null,null,null,null,"2"]
[null,"22",{"$f":"IF(Start!D28=\"\",\"\",Start!D28)","v":""},{"$f":"IF(Start!E28=\"\",\"\",Start!E28)","v":""},{"$f":"IF(Start!F28=\"\",\"\",Start!F28)","v":""},null,null,null,null,"2",null,null,null,null,null,"1"]
[null,"23",{"$f":"IF(Start!D29=\"\",\"\",Start!D29)","v":""},{"$f":"IF(Start!E29=\"\",\"\",Start!E29)","v":""},{"$f":"IF(Start!F29=\"\",\"\",Start!F29)","v":""},null,null,null,null,"1",null,null,null,null,null,"2"]
[null,"24",{"$f":"IF(Start!D30=\"\",\"\",Start!D30)","v":""},{"$f":"IF(Start!E30=\"\",\"\",Start!E30)","v":""},{"$f":"IF(Start!F30=\"\",\"\",Start!F30)","v":""},null,null,null,null,"2",null,null,null,null,null,"1"]
[null,"25",{"$f":"IF(Start!D31=\"\",\"\",Start!D31)","v":""},{"$f":"IF(Start!E31=\"\",\"\",Start!E31)","v":""},{"$f":"IF(Start!F31=\"\",\"\",Start!F31)","v":""},null,null,null,null,"1",null,null,null,null,null,"2"]
[null,"26",{"$f":"IF(Start!D32=\"\",\"\",Start!D32)","v":""},{"$f":"IF(Start!E32=\"\",\"\",Start!E32)","v":""},{"$f":"IF(Start!F32=\"\",\"\",Start!F32)","v":""},null,null,null,null,"2",null,null,null,null,null,"1"]
[null,"27",{"$f":"IF(Start!D33=\"\",\"\",Start!D33)","v":""},{"$f":"IF(Start!E33=\"\",\"\",Start!E33)","v":""},{"$f":"IF(Start!F33=\"\",\"\",Start!F33)","v":""},null,null,null,null,"1",null,null,null,null,null,"2"]
[null,"28",{"$f":"IF(Start!D34=\"\",\"\",Start!D34)","v":""},{"$f":"IF(Start!E34=\"\",\"\",Start!E34)","v":""},{"$f":"IF(Start!F34=\"\",\"\",Start!F34)","v":""},null,null,null,null,"2",null,null,null,null,null,"1"]
[null,"29",{"$f":"IF(Start!D35=\"\",\"\",Start!D35)","v":""},{"$f":"IF(Start!E35=\"\",\"\",Start!E35)","v":""},{"$f":"IF(Start!F35=\"\",\"\",Start!F35)","v":""},null,null,null,null,"1",null,null,null,null,null,"2"]
[null,"30",{"$f":"IF(Start!D36=\"\",\"\",Start!D36)","v":""},{"$f":"IF(Start!E36=\"\",\"\",Start!E36)","v":""},{"$f":"IF(Start!F36=\"\",\"\",Start!F36)","v":""},null,null,null,null,"2",null,null,null,null,null,"1"]
[null,"31",{"$f":"IF(Start!D37=\"\",\"\",Start!D37)","v":""},{"$f":"IF(Start!E37=\"\",\"\",Start!E37)","v":""},{"$f":"IF(Start!F37=\"\",\"\",Start!F37)","v":""},null,null,null,null,"1",null,null,null,null,null,"2"]
[null,"32",{"$f":"IF(Start!D38=\"\",\"\",Start!D38)","v":""},{"$f":"IF(Start!E38=\"\",\"\",Start!E38)","v":""},{"$f":"IF(Start!F38=\"\",\"\",Start!F38)","v":""},null,null,null,null,"2",null,null,null,null,null,"1"]
[null,"33",{"$f":"IF(Start!D39=\"\",\"\",Start!D39)","v":""},{"$f":"IF(Start!E39=\"\",\"\",Start!E39)","v":""},{"$f":"IF(Start!F39=\"\",\"\",Start!F39)","v":""},null,null,null,null,"1",null,null,null,null,null,"2"]
[null,"34",{"$f":"IF(Start!D40=\"\",\"\",Start!D40)","v":""},{"$f":"IF(Start!E40=\"\",\"\",Start!E40)","v":""},{"$f":"IF(Start!F40=\"\",\"\",Start!F40)","v":""},null,null,null,null,"2",null,null,null,null,null,"1"]
[null,"35",{"$f":"IF(Start!D41=\"\",\"\",Start!D41)","v":""},{"$f":"IF(Start!E41=\"\",\"\",Start!E41)","v":""},{"$f":"IF(Start!F41=\"\",\"\",Start!F41)","v":""},null,null,null,null,"1",null,null,null,null,null,"2"]
[null,"36",{"$f":"IF(Start!D42=\"\",\"\",Start!D42)","v":""},{"$f":"IF(Start!E42=\"\",\"\",Start!E42)","v":""},{"$f":"IF(Start!F42=\"\",\"\",Start!F42)","v":""},null,null,null,null,"2",null,null,null,null,null,"1"]
[null,"37",{"$f":"IF(Start!D43=\"\",\"\",Start!D43)","v":""},{"$f":"IF(Start!E43=\"\",\"\",Start!E43)","v":""},{"$f":"IF(Start!F43=\"\",\"\",Start!F43)","v":""},null,null,null,null,"1",null,null,null,null,null,"2"]
[null,"38",{"$f":"IF(Start!D44=\"\",\"\",Start!D44)","v":""},{"$f":"IF(Start!E44=\"\",\"\",Start!E44)","v":""},{"$f":"IF(Start!F44=\"\",\"\",Start!F44)","v":""},null,null,null,null,"2",null,null,null,null,null,"1"]
[null,"39",{"$f":"IF(Start!D45=\"\",\"\",Start!D45)","v":""},{"$f":"IF(Start!E45=\"\",\"\",Start!E45)","v":""},{"$f":"IF(Start!F45=\"\",\"\",Start!F45)","v":""},null,null,null,null,"1",null,null,null,null,null,"2"]
[null,"40",{"$f":"IF(Start!D46=\"\",\"\",Start!D46)","v":""},{"$f":"IF(Start!E46=\"\",\"\",Start!E46)","v":""},{"$f":"IF(Start!F46=\"\",\"\",Start!F46)","v":""},null,null,null,null,"2",null,null,null,null,null,"1"]
[null,"41",{"$f":"IF(Start!D47=\"\",\"\",Start!D47)","v":""},{"$f":"IF(Start!E47=\"\",\"\",Start!E47)","v":""},{"$f":"IF(Start!F47=\"\",\"\",Start!F47)","v":""},null,null,null,null,"1",null,null,null,null,null,"2"]
[null,"42",{"$f":"IF(Start!D48=\"\",\"\",Start!D48)","v":""},{"$f":"IF(Start!E48=\"\",\"\",Start!E48)","v":""},{"$f":"IF(Start!F48=\"\",\"\",Start!F48)","v":""},null,null,null,null,"2",null,null,null,null,null,"1"]
[null,"43",{"$f":"IF(Start!D49=\"\",\"\",Start!D49)","v":""},{"$f":"IF(Start!E49=\"\",\"\",Start!E49)","v":""},{"$f":"IF(Start!F49=\"\",\"\",Start!F49)","v":""},null,null,null,null,"1",null,null,null,null,null,"2"]
[null,"44",{"$f":"IF(Start!D50=\"\",\"\",Start!D50)","v":""},{"$f":"IF(Start!E50=\"\",\"\",Start!E50)","v":""},{"$f":"IF(Start!F50=\"\",\"\",Start!F50)","v":""},null,null,null,null,"2",null,null,null,null,null,"1"]
[null,"45",{"$f":"IF(Start!D51=\"\",\"\",Start!D51)","v":""},{"$f":"IF(Start!E51=\"\",\"\",Start!E51)","v":""},{"$f":"IF(Start!F51=\"\",\"\",Start!F51)","v":""},null,null,null,null,"1",null,null,null,null,null,"2"]
[null,"46",{"$f":"IF(Start!D52=\"\",\"\",Start!D52)","v":""},{"$f":"IF(Start!E52=\"\",\"\",Start!E52)","v":""},{"$f":"IF(Start!F52=\"\",\"\",Start!F52)","v":""},null,null,null,null,"2",null,null,null,null,null,"1"]
[null,"47",{"$f":"IF(Start!D53=\"\",\"\",Start!D53)","v":""},{"$f":"IF(Start!E53=\"\",\"\",Start!E53)","v":""},{"$f":"IF(Start!F53=\"\",\"\",Start!F53)","v":""},null,null,null,null,"1",null,null,null,null,null,"2"]
[null,"48",{"$f":"IF(Start!D54=\"\",\"\",Start!D54)","v":""},{"$f":"IF(Start!E54=\"\",\"\",Start!E54)","v":""},{"$f":"IF(Start!F54=\"\",\"\",Start!F54)","v":""},null,null,null,null,"2",null,null,null,null,null,"1"]
[null,"49",{"$f":"IF(Start!D55=\"\",\"\",Start!D55)","v":""},{"$f":"IF(Start!E55=\"\",\"\",Start!E55)","v":""},{"$f":"IF(Start!F55=\"\",\"\",Start!F55)","v":""},null,null,null,null,"1",null,null,null,null,null,"2"]
[null,"50",{"$f":"IF(Start!D56=\"\",\"\",Start!D56)","v":""},{"$f":"IF(Start!E56=\"\",\"\",Start!E56)","v":""},{"$f":"IF(Start!F56=\"\",\"\",Start!F56)","v":""},null,null,null,null,"2",null,null,null,null,null,"1"]

{"sheet":"PJ-V","index":6,"n_rows":54,"n_cols":23,"rows_kept":54,"cut":false,"hidden":false,"merged":[[0,1,0,16],[2,6,2,9],[2,11,2,14]]}
[null,"Běh na 100m s přek. - J - Zadání výsledků"]
[]
[null,null,null,{"$f":"Start!$D$5","v":"Dorky - Střední"},null,null,"I.",null,null,null,null,"II."]
[null,"Poř.","St.č.","Jméno","SDH",{"$f":"Start!$F$6","v":"Okres"},1,2,3,"Čas",null,1,2,3,"Čas",null,"C.",null,"P.",null,"B.",null,"X."]
[null,1,{"$f":"IF(Start!C7=\"\",\"\",Start!C7)","v":1},{"$f":"IF(Start!D7=\"\",\"\",Start!D7)","v":"Klára Trmotová"},{"$f":"IF(Start!E7=\"\",\"\",Start!E7)","v":"Dlažov"},{"$f":"IF(Start!F7=\"\",\"\",Start!F7)","v":"KT"},33.979999999999997,null,null,{"$f":"IF($D5=\"\",\"\",IF(OR($G5=\"DNF\",$H5=\"DNF\",$I5=\"DNF\",AND($G5=\"\",$H5=\"\",$I5=\"\")),\"DNF\",IF(OR($G5=\"NP\",$H5=\"NP\",$I5=\"NP\"),\"NP\",IF(ISERROR(MEDIAN($G5:$I5)),\"DNF\",IF(OR($G5=\"X\",$H5=\"X\",$I5=\"X\",$G5=\"\",$H5=\"\",$I5=\"\",$G5=\"x\",$H5=\"x\",$I5=\"x\"),MAX($G5:$I5),MEDIAN($G5:$I5))))))","v":33.979999999999997},null,20.440000000000001,null,null,{"$f":"IF($D5=\"\",\"\",IF(OR($L5=\"DNF\",$M5=\"DNF\",$N5=\"DNF\",AND($L5=\"\",$M5=\"\",$N5=\"\")),\"DNF\",IF(OR($L5=\"NP\",$M5=\"NP\",$N5=\"NP\"),\"NP\",IF(ISERROR(MEDIAN($L5:$N5)),\"DNF\",IF(OR($L5=\"X\",$M5=\"X\",$N5=\"X\",$L5=\"\",$M5=\"\",$N5=\"\",$L5=\"x\",$M5=\"x\",$N5=\"x\"),MAX($L5:$N5),MEDIAN($L5:$N5))))))","v":20.440000000000001},null,{"$f":"IF(D5=\"\",\"\",IF(OR(AND(J5=\"NP\",O5=\"NP\"),AND(J5=\"DNF\",O5=\"DNF\")),J5,IF(AND(J5=\"NP\",O5=\"DNF\"),J5,IF(AND(J5=\"DNF\",O5=\"NP\"),O5,MIN(J5,O5)))))","v":20.440000000000001},null,{"$f":"IF(D5=\"\",\"\",IF(OR(Q5=\"NP\",Q5=\"DNF\"),Q5,RANK(Q5,Q$5:Q$54,1)))","v":2},null,{"$f":"IF(D5=\"\",\"\",IF(Q5=\"NP\",MAX(S$5:S$54)+1,IF(Q5=\"DNF\",MAX(S$5:S$54)+COUNTIF(S$5:S$54,\"NP\")+1,RANK(Q5,Q$5:Q$54,1))))","v":2},null,{"$f":"IF($D5=\"\",9000,MAX(J5,O5)+(COUNTIF($J5:$J5,\"NP\")*600)+(COUNTIF($O5:$O5,\"NP\")*600)+(COUNTIF($J5:$J5,\"DNF\")*3600)+(COUNTIF($O5:$O5,\"DNF\")*3600))","v":33.979999999999997}]
[null,2,{"$f":"IF(Start!C8=\"\",\"\",Start!C8)","v":2},{"$f":"IF(Start!D8=\"\",\"\",Start!D8)","v":"Tereza Grünerová "},{"$f":"IF(Start!E8=\"\",\"\",Start!E8)","v":"Brod nad Tichou"},{"$f":"IF(Start!F8=\"\",\"\",Start!F8)","v":"TA"},32.08,null,null,{"$f":"IF($D6=\"\",\"\",IF(OR($G6=\"DNF\",$H6=\"DNF\",$I6=\"DNF\",AND($G6=\"\",$H6=\"\",$I6=\"\")),\"DNF\",IF(OR($G6=\"NP\",$H6=\"NP\",$I6=\"NP\"),\"NP\",IF(ISERROR(MEDIAN($G6:$I6)),\"DNF\",IF(OR($G6=\"X\",$H6=\"X\",$I6=\"X\",$G6=\"\",$H6=\"\",$I6=\"\",$G6=\"x\",$H6=\"x\",$I6=\"x\"),MAX($G6:$I6),MEDIAN($G6:$I6))))))","v":32.08},null,28.35,"NP",null,{"$f":"IF($D6=\"\",\"\",IF(OR($L6=\"DNF\",$M6=\"DNF\",$N6=\"DNF\",AND($L6=\"\",$M6=\"\",$N6=\"\")),\"DNF\",IF(OR($L6=\"NP\",$M6=\"NP\",$N6=\"NP\"),\"NP\",IF(ISERROR(MEDIAN($L6:$N6)),\"DNF\",IF(OR($L6=\"X\",$M6=\"X\",$N6=\"X\",$L6=\"\",$M6=\"\",$N6=\"\",$L6=\"x\",$M6=\"x\",$N6=\"x\"),MAX($L6:$N6),MEDIAN($L6:$N6))))))","v":"NP"},null,{"$f":"IF(D6=\"\",\"\",IF(OR(AND(J6=\"NP\",O6=\"NP\"),AND(J6=\"DNF\",O6=\"DNF\")),J6,IF(AND(J6=\"NP\",O6=\"DNF\"),J6,IF(AND(J6=\"DNF\",O6=\"NP\"),O6,MIN(J6,O6)))))","v":32.08},null,5,null,5,null,{"$f":"IF($D6=\"\",9000,MAX(J6,O6)+(COUNTIF($J6:$J6,\"NP\")*600)+(COUNTIF($O6:$O6,\"NP\")*600)+(COUNTIF($J6:$J6,\"DNF\")*3600)+(COUNTIF($O6:$O6,\"DNF\")*3600))","v":632.08000000000004}]
[null,3,{"$f":"IF(Start!C9=\"\",\"\",Start!C9)","v":3},{"$f":"IF(Start!D9=\"\",\"\",Start!D9)","v":"Iva Babková"},{"$f":"IF(Start!E9=\"\",\"\",Start!E9)","v":"Bystřice nad Úhlavou"},{"$f":"IF(Start!F9=\"\",\"\",Start!F9)","v":"KT"},22.33,null,null,22.33,null,19.28,null,null,19.28,null,19.28,null,1,null,1,null,22.33]
[null,4,{"$f":"IF(Start!C10=\"\",\"\",Start!C10)","v":4},{"$f":"IF(Start!D10=\"\",\"\",Start!D10)","v":"Michaela Marešová"},{"$f":"IF(Start!E10=\"\",\"\",Start!E10)","v":"Planá"},{"$f":"IF(Start!F10=\"\",\"\",Start!F10)","v":"TA"},30.94,null,null,30.94,null,23.66,null,null,23.66,null,23.66,null,3,null,3,null,30.94]
[null,5,{"$f":"IF(Start!C11=\"\",\"\",Start!C11)","v":5},{"$f":"IF(Start!D11=\"\",\"\",Start!D11)","v":"Adéla Stodolová"},{"$f":"IF(Start!E11=\"\",\"\",Start!E11)","v":"Planá"},{"$f":"IF(Start!F11=\"\",\"\",Start!F11)","v":"TA"},29.29,null,null,29.29,null,31.11,null,null,31.11,null,29.29,null,4,null,4,null,31.11]
[null,6,{"$f":"IF(Start!C12=\"\",\"\",Start!C12)","v":6},{"$f":"IF(Start!D12=\"\",\"\",Start!D12)","v":""},{"$f":"IF(Start!E12=\"\",\"\",Start!E12)","v":""},{"$f":"IF(Start!F12=\"\",\"\",Start!F12)","v":""},null,null,null,"",null,null,null,null,"",null,"",null,"",null,"",null,9000]
[null,7,{"$f":"IF(Start!C13=\"\",\"\",Start!C13)","v":7},{"$f":"IF(Start!D13=\"\",\"\",Start!D13)","v":""},{"$f":"IF(Start!E13=\"\",\"\",Start!E13)","v":""},{"$f":"IF(Start!F13=\"\",\"\",Start!F13)","v":""},null,null,null,"",null,null,null,null,"",null,"",null,"",null,"",null,9000]
[null,8,{"$f":"IF(Start!C14=\"\",\"\",Start!C14)","v":8},{"$f":"IF(Start!D14=\"\",\"\",Start!D14)","v":""},{"$f":"IF(Start!E14=\"\",\"\",Start!E14)","v":""},{"$f":"IF(Start!F14=\"\",\"\",Start!F14)","v":""},null,null,null,"",null,null,null,null,"",null,"",null,"",null,"",null,9000]
[null,9,{"$f":"IF(Start!C15=\"\",\"\",Start!C15)","v":9},{"$f":"IF(Start!D15=\"\",\"\",Start!D15)","v":""},{"$f":"IF(Start!E15=\"\",\"\",Start!E15)","v":""},{"$f":"IF(Start!F15=\"\",\"\",Start!F15)","v":""},null,null,null,"",null,null,null,null,"",null,"",null,"",null,"",null,9000]
[null,10,{"$f":"IF(Start!C16=\"\",\"\",Start!C16)","v":10},{"$f":"IF(Start!D16=\"\",\"\",Start!D16)","v":""},{"$f":"IF(Start!E16=\"\",\"\",Start!E16)","v":""},{"$f":"IF(Start!F16=\"\",\"\",Start!F16)","v":""},null,null,null,"",null,null,null,null,"",null,"",null,"",null,"",null,9000]
[null,11,{"$f":"IF(Start!C17=\"\",\"\",Start!C17)","v":11},{"$f":"IF(Start!D17=\"\",\"\",Start!D17)","v":""},{"$f":"IF(Start!E17=\"\",\"\",Start!E17)","v":""},{"$f":"IF(Start!F17=\"\",\"\",Start!F17)","v":""},null,null,null,"",null,null,null,null,"",null,"",null,"",null,"",null,9000]
[null,12,{"$f":"IF(Start!C18=\"\",\"\",Start!C18)","v":12},{"$f":"IF(Start!D18=\"\",\"\",Start!D18)","v":""},{"$f":"IF(Start!E18=\"\",\"\",Start!E18)","v":""},{"$f":"IF(Start!F18=\"\",\"\",Start!F18)","v":""},null,null,null,"",null,null,null,null,"",null,"",null,"",null,"",null,9000]
[null,13,{"$f":"IF(Start!C19=\"\",\"\",Start!C19)","v":13},{"$f":"IF(Start!D19=\"\",\"\",Start!D19)","v":""},{"$f":"IF(Start!E19=\"\",\"\",Start!E19)","v":""},{"$f":"IF(Start!F19=\"\",\"\",Start!F19)","v":""},null,null,null,"",null,null,null,null,"",null,"",null,"",null,"",null,9000]
[null,14,{"$f":"IF(Start!C20=\"\",\"\",Start!C20)","v":14},{"$f":"IF(Start!D20=\"\",\"\",Start!D20)","v":""},{"$f":"IF(Start!E20=\"\",\"\",Start!E20)","v":""},{"$f":"IF(Start!F20=\"\",\"\",Start!F20)","v":""},null,null,null,"",null,null,null,null,"",null,"",null,"",null,"",null,9000]
[null,15,{"$f":"IF(Start!C21=\"\",\"\",Start!C21)","v":15},{"$f":"IF(Start!D21=\"\",\"\",Start!D21)","v":""},{"$f":"IF(Start!E21=\"\",\"\",Start!E21)","v":""},{"$f":"IF(Start!F21=\"\",\"\",Start!F21)","v":""},null,null,null,"",null,null,null,null,"",null,"",null,"",null,"",null,9000]
[null,16,{"$f":"IF(Start!C22=\"\",\"\",Start!C22)","v":16},{"$f":"IF(Start!D22=\"\",\"\",Start!D22)","v":""},{"$f":"IF(Start!E22=\"\",\"\",Start!E22)","v":""},{"$f":"IF(Start!F22=\"\",\"\",Start!F22)","v":""},null,null,null,"",null,null,null,null,"",null,"",null,"",null,"",null,9000]
[null,17,{"$f":"IF(Start!C23=\"\",\"\",Start!C23)","v":17},{"$f":"IF(Start!D23=\"\",\"\",Start!D23)","v":""},{"$f":"IF(Start!E23=\"\",\"\",Start!E23)","v":""},{"$f":"IF(Start!F23=\"\",\"\",Start!F23)","v":""},null,null,null,"",null,null,null,null,"",null,"",null,"",null,"",null,9000]
[null,18,{"$f":"IF(Start!C24=\"\",\"\",Start!C24)","v":18},{"$f":"IF(Start!D24=\"\",\"\",Start!D24)","v":""},{"$f":"IF(Start!E24=\"\",\"\",Start!E24)","v":""},{"$f":"IF(Start!F24=\"\",\"\",Start!F24)","v":""},null,null,null,"",null,null,null,null,"",null,"",null,"",null,"",null,9000]
[null,19,{"$f":"IF(Start!C25=\"\",\"\",Start!C25)","v":19},{"$f":"IF(Start!D25=\"\",\"\",Start!D25)","v":""},{"$f":"IF(Start!E25=\"\",\"\",Start!E25)","v":""},{"$f":"IF(Start!F25=\"\",\"\",Start!F25)","v":""},null,null,null,"",null,null,null,null,"",null,"",null,"",null,"",null,9000]
[null,20,{"$f":"IF(Start!C26=\"\",\"\",Start!C26)","v":20},{"$f":"IF(Start!D26=\"\",\"\",Start!D26)","v":""},{"$f":"IF(Start!E26=\"\",\"\",Start!E26)","v":""},{"$f":"IF(Start!F26=\"\",\"\",Start!F26)","v":""},null,null,null,"",null,null,null,null,"",null,"",null,"",null,"",null,9000]
[null,21,{"$f":"IF(Start!C27=\"\",\"\",Start!C27)","v":21},{"$f":"IF(Start!D27=\"\",\"\",Start!D27)","v":""},{"$f":"IF(Start!E27=\"\",\"\",Start!E27)","v":""},{"$f":"IF(Start!F27=\"\",\"\",Start!F27)","v":""},null,null,null,"",null,null,null,null,"",null,"",null,"",null,"",null,9000]
[null,22,{"$f":"IF(Start!C28=\"\",\"\",Start!C28)","v":22},{"$f":"IF(Start!D28=\"\",\"\",Start!D28)","v":""},{"$f":"IF(Start!E28=\"\",\"\",Start!E28)","v":""},{"$f":"IF(Start!F28=\"\",\"\",Start!F28)","v":""},null,null,null,"",null,null,null,null,"",null,"",null,"",null,"",null,9000]
[null,3,{"$f":"IF(Start!C29=\"\",\"\",Start!C29)","v":23},{"$f":"IF(Start!D29=\"\",\"\",Start!D29)","v":""},{"$f":"IF(Start!E29=\"\",\"\",Start!E29)","v":""},{"$f":"IF(Start!F29=\"\",\"\",Start!F29)","v":""},null,null,null,"",null,null,null,null,"",null,"",null,{"$f":"IF(D27=\"\",\"\",IF(OR(Q27=\"NP\",Q27=\"DNF\"),Q27,RANK(Q27,Q$5:Q$54,1)))","v":""},null,{"$f":"IF(D27=\"\",\"\",IF(Q27=\"NP\",MAX(S$5:S$54)+1,IF(Q27=\"DNF\",MAX(S$5:S$54)+COUNTIF(S$5:S$54,\"NP\")+1,RANK(Q27,Q$5:Q$54,1))))","v":""},null,{"$f":"IF($D27=\"\",9000,MAX(J27,O27)+(COUNTIF($J27:$J27,\"NP\")*600)+(COUNTIF($O27:$O27,\"NP\")*600)+(COUNTIF($J27:$J27,\"DNF\")*3600)+(COUNTIF($O27:$O27,\"DNF\")*3600))","v":9000}]
[null,4,{"$f":"IF(Start!C30=\"\",\"\",Start!C30)","v":24},{"$f":"IF(Start!D30=\"\",\"\",Start!D30)","v":""},{"$f":"IF(Start!E30=\"\",\"\",Start!E30)","v":""},{"$f":"IF(Start!F30=\"\",\"\",Start!F30)","v":""},null,null,null,"",null,null,null,null,"",null,"",null,"",null,"",null,9000]
[null,5,{"$f":"IF(Start!C31=\"\",\"\",Start!C31)","v":25},{"$f":"IF(Start!D31=\"\",\"\",Start!D31)","v":""},{"$f":"IF(Start!E31=\"\",\"\",Start!E31)","v":""},{"$f":"IF(Start!F31=\"\",\"\",Start!F31)","v":""},null,null,null,"",null,null,null,null,"",null,"",null,"",null,"",null,9000]
[null,6,{"$f":"IF(Start!C32=\"\",\"\",Start!C32)","v":26},{"$f":"IF(Start!D32=\"\",\"\",Start!D32)","v":""},{"$f":"IF(Start!E32=\"\",\"\",Start!E32)","v":""},{"$f":"IF(Start!F32=\"\",\"\",Start!F32)","v":""},null,null,null,"",null,null,null,null,"",null,"",null,"",null,"",null,9000]
[null,7,{"$f":"IF(Start!C33=\"\",\"\",Start!C33)","v":27},{"$f":"IF(Start!D33=\"\",\"\",Start!D33)","v":""},{"$f":"IF(Start!E33=\"\",\"\",Start!E33)","v":""},{"$f":"IF(Start!F33=\"\",\"\",Start!F33)","v":""},null,null,null,"",null,null,null,null,"",null,"",null,"",null,"",null,9000]
[null,8,{"$f":"IF(Start!C34=\"\",\"\",Start!C34)","v":28},{"$f":"IF(Start!D34=\"\",\"\",Start!D34)","v":""},{"$f":"IF(Start!E34=\"\",\"\",Start!E34)","v":""},{"$f":"IF(Start!F34=\"\",\"\",Start!F34)","v":""},null,null,null,"",null,null,null,null,"",null,"",null,"",null,"",null,9000]
[null,9,{"$f":"IF(Start!C35=\"\",\"\",Start!C35)","v":29},{"$f":"IF(Start!D35=\"\",\"\",Start!D35)","v":""},{"$f":"IF(Start!E35=\"\",\"\",Start!E35)","v":""},{"$f":"IF(Start!F35=\"\",\"\",Start!F35)","v":""},null,null,null,"",null,null,null,null,"",null,"",null,"",null,"",null,9000]
[null,10,{"$f":"IF(Start!C36=\"\",\"\",Start!C36)","v":30},{"$f":"IF(Start!D36=\"\",\"\",Start!D36)","v":""},{"$f":"IF(Start!E36=\"\",\"\",Start!E36)","v":""},{"$f":"IF(Start!F36=\"\",\"\",Start!F36)","v":""},null,null,null,"",null,null,null,null,"",null,"",null,"",null,"",null,9000]
[null,11,{"$f":"IF(Start!C37=\"\",\"\",Start!C37)","v":31},{"$f":"IF(Start!D37=\"\",\"\",Start!D37)","v":""},{"$f":"IF(Start!E37=\"\",\"\",Start!E37)","v":""},{"$f":"IF(Start!F37=\"\",\"\",Start!F37)","v":""},null,null,null,"",null,null,null,null,"",null,"",null,"",null,"",null,9000]
[null,12,{"$f":"IF(Start!C38=\"\",\"\",Start!C38)","v":32},{"$f":"IF(Start!D38=\"\",\"\",Start!D38)","v":""},{"$f":"IF(Start!E38=\"\",\"\",Start!E38)","v":""},{"$f":"IF(Start!F38=\"\",\"\",Start!F38)","v":""},null,null,null,"",null,null,null,null,"",null,"",null,"",null,"",null,9000]
[null,13,{"$f":"IF(Start!C39=\"\",\"\",Start!C39)","v":33},{"$f":"IF(Start!D39=\"\",\"\",Start!D39)","v":""},{"$f":"IF(Start!E39=\"\",\"\",Start!E39)","v":""},{"$f":"IF(Start!F39=\"\",\"\",Start!F39)","v":""},null,null,null,"",null,null,null,null,"",null,"",null,"",null,"",null,9000]
[null,14,{"$f":"IF(Start!C40=\"\",\"\",Start!C40)","v":34},{"$f":"IF(Start!D40=\"\",\"\",Start!D40)","v":""},{"$f":"IF(Start!E40=\"\",\"\",Start!E40)","v":""},{"$f":"IF(Start!F40=\"\",\"\",Start!F40)","v":""},null,null,null,"",null,null,null,null,"",null,"",null,"",null,"",null,9000]
[null,15,{"$f":"IF(Start!C41=\"\",\"\",Start!C41)","v":35},{"$f":"IF(Start!D41=\"\",\"\",Start!D41)","v":""},{"$f":"IF(Start!E41=\"\",\"\",Start!E41)","v":""},{"$f":"IF(Start!F41=\"\",\"\",Start!F41)","v":""},null,null,null,"",null,null,null,null,"",null,"",null,"",null,"",null,9000]
[null,16,{"$f":"IF(Start!C42=\"\",\"\",Start!C42)","v":36},{"$f":"IF(Start!D42=\"\",\"\",Start!D42)","v":""},{"$f":"IF(Start!E42=\"\",\"\",Start!E42)","v":""},{"$f":"IF(Start!F42=\"\",\"\",Start!F42)","v":""},null,null,null,"",null,null,null,null,"",null,"",null,"",null,"",null,9000]
[null,17,{"$f":"IF(Start!C43=\"\",\"\",Start!C43)","v":37},{"$f":"IF(Start!D43=\"\",\"\",Start!D43)","v":""},{"$f":"IF(Start!E43=\"\",\"\",Start!E43)","v":""},{"$f":"IF(Start!F43=\"\",\"\",Start!F43)","v":""},null,null,null,"",null,null,null,null,"",null,"",null,"",null,"",null,9000]
[null,18,{"$f":"IF(Start!C44=\"\",\"\",Start!C44)","v":38},{"$f":"IF(Start!D44=\"\",\"\",Start!D44)","v":""},{"$f":"IF(Start!E44=\"\",\"\",Start!E44)","v":""},{"$f":"IF(Start!F44=\"\",\"\",Start!F44)","v":""},null,null,null,"",null,null,null,null,"",null,"",null,"",null,"",null,9000]
[null,19,{"$f":"IF(Start!C45=\"\",\"\",Start!C45)","v":39},{"$f":"IF(Start!D45=\"\",\"\",Start!D45)","v":""},{"$f":"IF(Start!E45=\"\",\"\",Start!E45)","v":""},{"$f":"IF(Start!F45=\"\",\"\",Start!F45)","v":""},null,null,null,"",null,null,null,null,"",null,"",null,"",null,"",null,9000]
[null,20,{"$f":"IF(Start!C46=\"\",\"\",Start!C46)","v":40},{"$f":"IF(Start!D46=\"\",\"\",Start!D46)","v":""},{"$f":"IF(Start!E46=\"\",\"\",Start!E46)","v":""},{"$f":"IF(Start!F46=\"\",\"\",Start!F46)","v":""},null,null,null,"",null,null,null,null,"",null,"",null,"",null,"",null,9000]
[null,21,{"$f":"IF(Start!C47=\"\",\"\",Start!C47)","v":41},{"$f":"IF(Start!D47=\"\",\"\",Start!D47)","v":""},{"$f":"IF(Start!E47=\"\",\"\",Start!E47)","v":""},{"$f":"IF(Start!F47=\"\",\"\",Start!F47)","v":""},null,null,null,"",null,null,null,null,"",null,"",null,"",null,"",null,9000]
[null,16,{"$f":"IF(Start!C48=\"\",\"\",Start!C48)","v":42},{"$f":"IF(Start!D48=\"\",\"\",Start!D48)","v":""},{"$f":"IF(Start!E48=\"\",\"\",Start!E48)","v":""},{"$f":"IF(Start!F48=\"\",\"\",Start!F48)","v":""},null,null,null,"",null,null,null,null,"",null,"",null,{"$f":"IF(D46=\"\",\"\",IF(OR(Q46=\"NP\",Q46=\"DNF\"),Q46,RANK(Q46,Q$5:Q$54,1)))","v":""},null,{"$f":"IF(D46=\"\",\"\",IF(Q46=\"NP\",MAX(S$5:S$54)+1,IF(Q46=\"DNF\",MAX(S$5:S$54)+COUNTIF(S$5:S$54,\"NP\")+1,RANK(Q46,Q$5:Q$54,1))))","v":""},null,{"$f":"IF($D46=\"\",9000,MAX(J46,O46)+(COUNTIF($J46:$J46,\"NP\")*600)+(COUNTIF($O46:$O46,\"NP\")*600)+(COUNTIF($J46:$J46,\"DNF\")*3600)+(COUNTIF($O46:$O46,\"DNF\")*3600))","v":9000}]
[null,17,{"$f":"IF(Start!C49=\"\",\"\",Start!C49)","v":43},{"$f":"IF(Start!D49=\"\",\"\",Start!D49)","v":""},{"$f":"IF(Start!E49=\"\",\"\",Start!E49)","v":""},{"$f":"IF(Start!F49=\"\",\"\",Start!F49)","v":""},null,null,null,"",null,null,null,null,"",null,"",null,{"$f":"IF(D47=\"\",\"\",IF(OR(Q47=\"NP\",Q47=\"DNF\"),Q47,RANK(Q47,Q$5:Q$54,1)))","v":""},null,{"$f":"IF(D47=\"\",\"\",IF(Q47=\"NP\",MAX(S$5:S$54)+1,IF(Q47=\"DNF\",MAX(S$5:S$54)+COUNTIF(S$5:S$54,\"NP\")+1,RANK(Q47,Q$5:Q$54,1))))","v":""},null,{"$f":"IF($D47=\"\",9000,MAX(J47,O47)+(COUNTIF($J47:$J47,\"NP\")*600)+(COUNTIF($O47:$O47,\"NP\")*600)+(COUNTIF($J47:$J47,\"DNF\")*3600)+(COUNTIF($O47:$O47,\"DNF\")*3600))","v":9000}]
[null,18,{"$f":"IF(Start!C50=\"\",\"\",Start!C50)","v":44},{"$f":"IF(Start!D50=\"\",\"\",Start!D50)","v":""},{"$f":"IF(Start!E50=\"\",\"\",Start!E50)","v":""},{"$f":"IF(Start!F50=\"\",\"\",Start!F50)","v":""},null,null,null,"",null,null,null,null,"",null,"",null,{"$f":"IF(D48=\"\",\"\",IF(OR(Q48=\"NP\",Q48=\"DNF\"),Q48,RANK(Q48,Q$5:Q$54,1)))","v":""},null,{"$f":"IF(D48=\"\",\"\",IF(Q48=\"NP\",MAX(S$5:S$54)+1,IF(Q48=\"DNF\",MAX(S$5:S$54)+COUNTIF(S$5:S$54,\"NP\")+1,RANK(Q48,Q$5:Q$54,1))))","v":""},null,{"$f":"IF($D48=\"\",9000,MAX(J48,O48)+(COUNTIF($J48:$J48,\"NP\")*600)+(COUNTIF($O48:$O48,\"NP\")*600)+(COUNTIF($J48:$J48,\"DNF\")*3600)+(COUNTIF($O48:$O48,\"DNF\")*3600))","v":9000}]
[null,19,{"$f":"IF(Start!C51=\"\",\"\",Start!C51)","v":45},{"$f":"IF(Start!D51=\"\",\"\",Start!D51)","v":""},{"$f":"IF(Start!E51=\"\",\"\",Start!E51)","v":""},{"$f":"IF(Start!F51=\"\",\"\",Start!F51)","v":""},null,null,null,"",null,null,null,null,"",null,"",null,{"$f":"IF(D49=\"\",\"\",IF(OR(Q49=\"NP\",Q49=\"DNF\"),Q49,RANK(Q49,Q$5:Q$54,1)))","v":""},null,{"$f":"IF(D49=\"\",\"\",IF(Q49=\"NP\",MAX(S$5:S$54)+1,IF(Q49=\"DNF\",MAX(S$5:S$54)+COUNTIF(S$5:S$54,\"NP\")+1,RANK(Q49,Q$5:Q$54,1))))","v":""},null,{"$f":"IF($D49=\"\",9000,MAX(J49,O49)+(COUNTIF($J49:$J49,\"NP\")*600)+(COUNTIF($O49:$O49,\"NP\")*600)+(COUNTIF($J49:$J49,\"DNF\")*3600)+(COUNTIF($O49:$O49,\"DNF\")*3600))","v":9000}]
[null,20,{"$f":"IF(Start!C52=\"\",\"\",Start!C52)","v":46},{"$f":"IF(Start!D52=\"\",\"\",Start!D52)","v":""},{"$f":"IF(Start!E52=\"\",\"\",Start!E52)","v":""},{"$f":"IF(Start!F52=\"\",\"\",Start!F52)","v":""},null,null,null,"",null,null,null,null,"",null,"",null,{"$f":"IF(D50=\"\",\"\",IF(OR(Q50=\"NP\",Q50=\"DNF\"),Q50,RANK(Q50,Q$5:Q$54,1)))","v":""},null,{"$f":"IF(D50=\"\",\"\",IF(Q50=\"NP\",MAX(S$5:S$54)+1,IF(Q50=\"DNF\",MAX(S$5:S$54)+COUNTIF(S$5:S$54,\"NP\")+1,RANK(Q50,Q$5:Q$54,1))))","v":""},null,{"$f":"IF($D50=\"\",9000,MAX(J50,O50)+(COUNTIF($J50:$J50,\"NP\")*600)+(COUNTIF($O50:$O50,\"NP\")*600)+(COUNTIF($J50:$J50,\"DNF\")*3600)+(COUNTIF($O50:$O50,\"DNF\")*3600))","v":9000}]
[null,22,{"$f":"IF(Start!C53=\"\",\"\",Start!C53)","v":47},{"$f":"IF(Start!D53=\"\",\"\",Start!D53)","v":""},{"$f":"IF(Start!E53=\"\",\"\",Start!E53)","v":""},{"$f":"IF(Start!F53=\"\",\"\",Start!F53)","v":""},null,null,null,"",null,null,null,null,"",null,"",null,"",null,"",null,9000]
[null,23,{"$f":"IF(Start!C54=\"\",\"\",Start!C54)","v":48},{"$f":"IF(Start!D54=\"\",\"\",Start!D54)","v":""},{"$f":"IF(Start!E54=\"\",\"\",Start!E54)","v":""},{"$f":"IF(Start!F54=\"\",\"\",Start!F54)","v":""},null,null,null,"",null,null,null,null,"",null,"",null,"",null,"",null,9000]
[null,24,{"$f":"IF(Start!C55=\"\",\"\",Start!C55)","v":49},{"$f":"IF(Start!D55=\"\",\"\",Start!D55)","v":""},{"$f":"IF(Start!E55=\"\",\"\",Start!E55)","v":""},{"$f":"IF(Start!F55=\"\",\"\",Start!F55)","v":""},null,null,null,"",null,null,null,null,"",null,"",null,"",null,"",null,9000]
[null,25,{"$f":"IF(Start!C56=\"\",\"\",Start!C56)","v":50},{"$f":"IF(Start!D56=\"\",\"\",Start!D56)","v":""},{"$f":"IF(Start!E56=\"\",\"\",Start!E56)","v":""},{"$f":"IF(Start!F56=\"\",\"\",Start!F56)","v":""},null,null,null,"",null,null,null,null,"",null,"",null,"",null,"",null,9000]

{"sheet":"PJ - P","index":7,"n_rows":50,"n_cols":26,"rows_kept":50,"cut":false,"hidden":false,"merged":[]}
[null,3,"Iva Babková","Bystřice nad Úhlavou","KT",22.33,null,null,22.33,null,19.28,null,null,19.28,null,19.28,null,1,null,1,null,22.33,1,null,"",6]
[null,1,"Klára Trmotová","Dlažov","KT",33.979999999999997,null,null,33.979999999999997,null,20.440000000000001,null,null,20.440000000000001,null,20.440000000000001,null,2,null,2,null,33.979999999999997,2,null,"",6]
[null,4,"Michaela Marešová","Planá","TA",30.94,null,null,30.94,null,23.66,null,null,23.66,null,23.66,null,3,null,3,null,30.94,3,null,"",6]
[null,5,"Adéla Stodolová","Planá","TA",29.29,null,null,29.29,null,31.11,null,null,31.11,null,29.29,null,4,null,4,null,31.11,4,null,"",6]
[null,2,"Tereza Grünerová ","Brod nad Tichou","TA",32.08,null,null,32.08,null,28.35,"NP",null,"NP",null,32.08,null,5,null,5,null,632.08000000000004,5,null,"",6]
[null,6,"","","",null,null,null,"",null,null,null,null,"",null,"",null,"",null,"",null,9000,6,null,"",6]
[null,7,"","","",null,null,null,"",null,null,null,null,"",null,"",null,"",null,"",null,9000,6,null,"",6]
[null,8,"","","",null,null,null,"",null,null,null,null,"",null,"",null,"",null,"",null,9000,6,null,"",6]
[null,9,"","","",null,null,null,"",null,null,null,null,"",null,"",null,"",null,"",null,9000,6,null,"",6]
[null,10,"","","",null,null,null,"",null,null,null,null,"",null,"",null,"",null,"",null,9000,6,null,"",6]
[null,11,"","","",null,null,null,"",null,null,null,null,"",null,"",null,"",null,"",null,9000,6,null,"",6]
[null,12,"","","",null,null,null,"",null,null,null,null,"",null,"",null,"",null,"",null,9000,6,null,"",6]
[null,13,"","","",null,null,null,"",null,null,null,null,"",null,"",null,"",null,"",null,9000,6,null,"",6]
[null,14,"","","",null,null,null,"",null,null,null,null,"",null,"",null,"",null,"",null,9000,6,null,"",6]
[null,15,"","","",null,null,null,"",null,null,null,null,"",null,"",null,"",null,"",null,9000,6,null,"",6]
[null,16,"","","",null,null,null,"",null,null,null,null,"",null,"",null,"",null,"",null,9000,6,null,"",6]
[null,17,"","","",null,null,null,"",null,null,null,null,"",null,"",null,"",null,"",null,9000,6,null,"",6]
[null,18,"","","",null,null,null,"",null,null,null,null,"",null,"",null,"",null,"",null,9000,6,null,"",6]
[null,19,"","","",null,null,null,"",null,null,null,null,"",null,"",null,"",null,"",null,9000,6,null,"",6]
[null,20,"","","",null,null,null,"",null,null,null,null,"",null,"",null,"",null,"",null,9000,6,null,"",6]
[null,21,"","","",null,null,null,"",null,null,null,null,"",null,"",null,"",null,"",null,9000,6,null,"",6]
[null,22,"","","",null,null,null,"",null,null,null,null,"",null,"",null,"",null,"",null,9000,6,null,"",6]
[null,23,"","","",null,null,null,"",null,null,null,null,"",null,"",null,"",null,"",null,9000,6,null,"",6]
[null,24,"","","",null,null,null,"",null,null,null,null,"",null,"",null,"",null,"",null,9000,6,null,"",6]
[null,25,"","","",null,null,null,"",null,null,null,null,"",null,"",null,"",null,"",null,9000,6,null,"",6]
[null,26,"","","",null,null,null,"",null,null,null,null,"",null,"",null,"",null,"",null,9000,6,null,"",6]
[null,27,"","","",null,null,null,"",null,null,null,null,"",null,"",null,"",null,"",null,9000,6,null,"",6]
[null,28,"","","",null,null,null,"",null,null,null,null,"",null,"",null,"",null,"",null,9000,6,null,"",6]
[null,29,"","","",null,null,null,"",null,null,null,null,"",null,"",null,"",null,"",null,9000,6,null,"",6]
[null,30,"","","",null,null,null,"",null,null,null,null,"",null,"",null,"",null,"",null,9000,6,null,"",6]
[null,31,"","","",null,null,null,"",null,null,null,null,"",null,"",null,"",null,"",null,9000,6,null,"",6]
[null,32,"","","",null,null,null,"",null,null,null,null,"",null,"",null,"",null,"",null,9000,6,null,"",6]
[null,33,"","","",null,null,null,"",null,null,null,null,"",null,"",null,"",null,"",null,9000,6,null,"",6]
[null,34,"","","",null,null,null,"",null,null,null,null,"",null,"",null,"",null,"",null,9000,6,null,"",6]
[null,35,"","","",null,null,null,"",null,null,null,null,"",null,"",null,"",null,"",null,9000,6,null,"",6]
[null,36,"","","",null,null,null,"",null,null,null,null,"",null,"",null,"",null,"",null,9000,6,null,"",6]
[null,37,"","","",null,null,null,"",null,null,null,null,"",null,"",null,"",null,"",null,9000,6,null,"",6]
[null,38,"","","",null,null,null,"",null,null,null,null,"",null,"",null,"",null,"",null,9000,6,null,"",6]
[null,39,"","","",null,null,null,"",null,null,null,null,"",null,"",null,"",null,"",null,9000,6,null,"",6]
[null,40,"","","",null,null,null,"",null,null,null,null,"",null,"",null,"",null,"",null,9000,6,null,"",6]
[null,41,"","","",null,null,null,"",null,null,null,null,"",null,"",null,"",null,"",null,9000,6,null,"",6]
[null,42,"","","",null,null,null,"",null,null,null,null,"",null,"",null,"",null,"",null,9000,6,null,"",6]
[null,43,"","","",null,null,null,"",null,null,null,null,"",null,"",null,"",null,"",null,9000,6,null,"",6]
[null,44,"","","",null,null,null,"",null,null,null,null,"",null,"",null,"",null,"",null,9000,6,null,"",6]
[null,45,"","","",null,null,null,"",null,null,null,null,"",null,"",null,"",null,"",null,9000,6,null,"",6]
[null,46,"","","",null,null,null,"",null,null,null,null,"",null,"",null,"",null,"",null,9000,6,null,"Adéla Stodolová",4]
[null,47,"","","",null,null,null,"",null,null,null,null,"",null,"",null,"",null,"",null,9000,6,null,"Iva Babková",1]
[null,48,"","","",null,null,null,"",null,null,null,null,"",null,"",null,"",null,"",null,9000,6,null,"Klára Trmotová",2]
[null,49,"","","",null,null,null,"",null,null,null,null,"",null,"",null,"",null,"",null,9000,6,null,"Michaela Marešová",3]
[null,50,"","","",null,null,null,"",null,null,null,null,"",null,"",null,"",null,"",null,9000,6,null,"Tereza Grünerová ",5]

{"sheet":"PJ-P","index":8,"n_rows":57,"n_cols":10,"rows_kept":57,"cut":false,"hidden":false,"merged":[[2,1,2,3],[2,4,2,9],[0,1,0,9],[5,4,6,4],[5,6,6,6],[5,7,6,7],[5,9,6,9],[4,1,4,2],[5,1,6,1],[5,5,6,5],[5,2,6,2],[5,3,6,3]]}
[null,"Běh na 100m s přek. - Pořadí"]
[]
[null,{"$f":"Start!$B$2","v":"Krajské kolo soutěží dorostu"},null,null,{"$f":"Start!$B$3","v":"19. června 2021 Tachov"}]
[]
[null,{"$f":"Start!$D$5","v":"Dorky - Střední"}]
[null,"Pořadí","Start. číslo","Jméno","SDH",{"$f":"Start!$F$6","v":"Okres"},"čas             I. pokusu","čas            II. pokusu",null,"Výsledný čas"]
[]
[null,{"$f":"IF('PJ - P'!C1=\"\",\"\",'PJ - P'!W1)","v":1},{"$f":"IF('PJ - P'!C1=\"\",\"\",'PJ - P'!B1)","v":3},{"$f":"IF('PJ - P'!C1=\"\",\"\",'PJ - P'!C1)","v":"Iva Babková"},{"$f":"IF('PJ - P'!D1=\"\",\"\",'PJ - P'!D1)","v":"Bystřice nad Úhlavou"},{"$f":"IF('PJ - P'!E1=\"\",\"\",'PJ - P'!E1)","v":"KT"},{"$f":"IF('PJ - P'!I1=\"\",\"\",'PJ - P'!I1)","v":22.33},{"$f":"IF('PJ - P'!N1=\"\",\"\",'PJ - P'!N1)","v":19.28},null,{"$f":"IF('PJ - P'!P1=\"\",\"\",'PJ - P'!P1)","v":19.28}]
[null,{"$f":"IF('PJ - P'!C2=\"\",\"\",'PJ - P'!W2)","v":2},{"$f":"IF('PJ - P'!C2=\"\",\"\",'PJ - P'!B2)","v":1},{"$f":"IF('PJ - P'!C2=\"\",\"\",'PJ - P'!C2)","v":"Klára Trmotová"},{"$f":"IF('PJ - P'!D2=\"\",\"\",'PJ - P'!D2)","v":"Dlažov"},{"$f":"IF('PJ - P'!E2=\"\",\"\",'PJ - P'!E2)","v":"KT"},{"$f":"IF('PJ - P'!I2=\"\",\"\",'PJ - P'!I2)","v":33.979999999999997},{"$f":"IF('PJ - P'!N2=\"\",\"\",'PJ - P'!N2)","v":20.440000000000001},null,{"$f":"IF('PJ - P'!P2=\"\",\"\",'PJ - P'!P2)","v":20.440000000000001}]
[null,{"$f":"IF('PJ - P'!C3=\"\",\"\",'PJ - P'!W3)","v":3},{"$f":"IF('PJ - P'!C3=\"\",\"\",'PJ - P'!B3)","v":4},{"$f":"IF('PJ - P'!C3=\"\",\"\",'PJ - P'!C3)","v":"Michaela Marešová"},{"$f":"IF('PJ - P'!D3=\"\",\"\",'PJ - P'!D3)","v":"Planá"},{"$f":"IF('PJ - P'!E3=\"\",\"\",'PJ - P'!E3)","v":"TA"},{"$f":"IF('PJ - P'!I3=\"\",\"\",'PJ - P'!I3)","v":30.94},{"$f":"IF('PJ - P'!N3=\"\",\"\",'PJ - P'!N3)","v":23.66},null,{"$f":"IF('PJ - P'!P3=\"\",\"\",'PJ - P'!P3)","v":23.66}]
[null,{"$f":"IF('PJ - P'!C4=\"\",\"\",'PJ - P'!W4)","v":4},{"$f":"IF('PJ - P'!C4=\"\",\"\",'PJ - P'!B4)","v":5},{"$f":"IF('PJ - P'!C4=\"\",\"\",'PJ - P'!C4)","v":"Adéla Stodolová"},{"$f":"IF('PJ - P'!D4=\"\",\"\",'PJ - P'!D4)","v":"Planá"},{"$f":"IF('PJ - P'!E4=\"\",\"\",'PJ - P'!E4)","v":"TA"},{"$f":"IF('PJ - P'!I4=\"\",\"\",'PJ - P'!I4)","v":29.29},{"$f":"IF('PJ - P'!N4=\"\",\"\",'PJ - P'!N4)","v":31.11},null,{"$f":"IF('PJ - P'!P4=\"\",\"\",'PJ - P'!P4)","v":29.29}]
[null,{"$f":"IF('PJ - P'!C5=\"\",\"\",'PJ - P'!W5)","v":5},{"$f":"IF('PJ - P'!C5=\"\",\"\",'PJ - P'!B5)","v":2},{"$f":"IF('PJ - P'!C5=\"\",\"\",'PJ - P'!C5)","v":"Tereza Grünerová "},{"$f":"IF('PJ - P'!D5=\"\",\"\",'PJ - P'!D5)","v":"Brod nad Tichou"},{"$f":"IF('PJ - P'!E5=\"\",\"\",'PJ - P'!E5)","v":"TA"},{"$f":"IF('PJ - P'!I5=\"\",\"\",'PJ - P'!I5)","v":32.08},{"$f":"IF('PJ - P'!N5=\"\",\"\",'PJ - P'!N5)","v":"NP"},null,{"$f":"IF('PJ - P'!P5=\"\",\"\",'PJ - P'!P5)","v":32.08}]
[null,{"$f":"IF('PJ - P'!C6=\"\",\"\",'PJ - P'!W6)","v":""},{"$f":"IF('PJ - P'!C6=\"\",\"\",'PJ - P'!B6)","v":""},{"$f":"IF('PJ - P'!C6=\"\",\"\",'PJ - P'!C6)","v":""},{"$f":"IF('PJ - P'!D6=\"\",\"\",'PJ - P'!D6)","v":""},{"$f":"IF('PJ - P'!E6=\"\",\"\",'PJ - P'!E6)","v":""},{"$f":"IF('PJ - P'!I6=\"\",\"\",'PJ - P'!I6)","v":""},{"$f":"IF('PJ - P'!N6=\"\",\"\",'PJ - P'!N6)","v":""},null,{"$f":"IF('PJ - P'!P6=\"\",\"\",'PJ - P'!P6)","v":""}]
[null,{"$f":"IF('PJ - P'!C7=\"\",\"\",'PJ - P'!W7)","v":""},{"$f":"IF('PJ - P'!C7=\"\",\"\",'PJ - P'!B7)","v":""},{"$f":"IF('PJ - P'!C7=\"\",\"\",'PJ - P'!C7)","v":""},{"$f":"IF('PJ - P'!D7=\"\",\"\",'PJ - P'!D7)","v":""},{"$f":"IF('PJ - P'!E7=\"\",\"\",'PJ - P'!E7)","v":""},{"$f":"IF('PJ - P'!I7=\"\",\"\",'PJ - P'!I7)","v":""},{"$f":"IF('PJ - P'!N7=\"\",\"\",'PJ - P'!N7)","v":""},null,{"$f":"IF('PJ - P'!P7=\"\",\"\",'PJ - P'!P7)","v":""}]
[null,{"$f":"IF('PJ - P'!C8=\"\",\"\",'PJ - P'!W8)","v":""},{"$f":"IF('PJ - P'!C8=\"\",\"\",'PJ - P'!B8)","v":""},{"$f":"IF('PJ - P'!C8=\"\",\"\",'PJ - P'!C8)","v":""},{"$f":"IF('PJ - P'!D8=\"\",\"\",'PJ - P'!D8)","v":""},{"$f":"IF('PJ - P'!E8=\"\",\"\",'PJ - P'!E8)","v":""},{"$f":"IF('PJ - P'!I8=\"\",\"\",'PJ - P'!I8)","v":""},{"$f":"IF('PJ - P'!N8=\"\",\"\",'PJ - P'!N8)","v":""},null,{"$f":"IF('PJ - P'!P8=\"\",\"\",'PJ - P'!P8)","v":""}]
[null,{"$f":"IF('PJ - P'!C9=\"\",\"\",'PJ - P'!W9)","v":""},{"$f":"IF('PJ - P'!C9=\"\",\"\",'PJ - P'!B9)","v":""},{"$f":"IF('PJ - P'!C9=\"\",\"\",'PJ - P'!C9)","v":""},{"$f":"IF('PJ - P'!D9=\"\",\"\",'PJ - P'!D9)","v":""},{"$f":"IF('PJ - P'!E9=\"\",\"\",'PJ - P'!E9)","v":""},{"$f":"IF('PJ - P'!I9=\"\",\"\",'PJ - P'!I9)","v":""},{"$f":"IF('PJ - P'!N9=\"\",\"\",'PJ - P'!N9)","v":""},null,{"$f":"IF('PJ - P'!P9=\"\",\"\",'PJ - P'!P9)","v":""}]
[null,{"$f":"IF('PJ - P'!C10=\"\",\"\",'PJ - P'!W10)","v":""},{"$f":"IF('PJ - P'!C10=\"\",\"\",'PJ - P'!B10)","v":""},{"$f":"IF('PJ - P'!C10=\"\",\"\",'PJ - P'!C10)","v":""},{"$f":"IF('PJ - P'!D10=\"\",\"\",'PJ - P'!D10)","v":""},{"$f":"IF('PJ - P'!E10=\"\",\"\",'PJ - P'!E10)","v":""},{"$f":"IF('PJ - P'!I10=\"\",\"\",'PJ - P'!I10)","v":""},{"$f":"IF('PJ - P'!N10=\"\",\"\",'PJ - P'!N10)","v":""},null,{"$f":"IF('PJ - P'!P10=\"\",\"\",'PJ - P'!P10)","v":""}]
[null,{"$f":"IF('PJ - P'!C11=\"\",\"\",'PJ - P'!W11)","v":""},{"$f":"IF('PJ - P'!C11=\"\",\"\",'PJ - P'!B11)","v":""},{"$f":"IF('PJ - P'!C11=\"\",\"\",'PJ - P'!C11)","v":""},{"$f":"IF('PJ - P'!D11=\"\",\"\",'PJ - P'!D11)","v":""},{"$f":"IF('PJ - P'!E11=\"\",\"\",'PJ - P'!E11)","v":""},{"$f":"IF('PJ - P'!I11=\"\",\"\",'PJ - P'!I11)","v":""},{"$f":"IF('PJ - P'!N11=\"\",\"\",'PJ - P'!N11)","v":""},null,{"$f":"IF('PJ - P'!P11=\"\",\"\",'PJ - P'!P11)","v":""}]
[null,{"$f":"IF('PJ - P'!C12=\"\",\"\",'PJ - P'!W12)","v":""},{"$f":"IF('PJ - P'!C12=\"\",\"\",'PJ - P'!B12)","v":""},{"$f":"IF('PJ - P'!C12=\"\",\"\",'PJ - P'!C12)","v":""},{"$f":"IF('PJ - P'!D12=\"\",\"\",'PJ - P'!D12)","v":""},{"$f":"IF('PJ - P'!E12=\"\",\"\",'PJ - P'!E12)","v":""},{"$f":"IF('PJ - P'!I12=\"\",\"\",'PJ - P'!I12)","v":""},{"$f":"IF('PJ - P'!N12=\"\",\"\",'PJ - P'!N12)","v":""},null,{"$f":"IF('PJ - P'!P12=\"\",\"\",'PJ - P'!P12)","v":""}]
[null,{"$f":"IF('PJ - P'!C13=\"\",\"\",'PJ - P'!W13)","v":""},{"$f":"IF('PJ - P'!C13=\"\",\"\",'PJ - P'!B13)","v":""},{"$f":"IF('PJ - P'!C13=\"\",\"\",'PJ - P'!C13)","v":""},{"$f":"IF('PJ - P'!D13=\"\",\"\",'PJ - P'!D13)","v":""},{"$f":"IF('PJ - P'!E13=\"\",\"\",'PJ - P'!E13)","v":""},{"$f":"IF('PJ - P'!I13=\"\",\"\",'PJ - P'!I13)","v":""},{"$f":"IF('PJ - P'!N13=\"\",\"\",'PJ - P'!N13)","v":""},null,{"$f":"IF('PJ - P'!P13=\"\",\"\",'PJ - P'!P13)","v":""}]
[null,{"$f":"IF('PJ - P'!C14=\"\",\"\",'PJ - P'!W14)","v":""},{"$f":"IF('PJ - P'!C14=\"\",\"\",'PJ - P'!B14)","v":""},{"$f":"IF('PJ - P'!C14=\"\",\"\",'PJ - P'!C14)","v":""},{"$f":"IF('PJ - P'!D14=\"\",\"\",'PJ - P'!D14)","v":""},{"$f":"IF('PJ - P'!E14=\"\",\"\",'PJ - P'!E14)","v":""},{"$f":"IF('PJ - P'!I14=\"\",\"\",'PJ - P'!I14)","v":""},{"$f":"IF('PJ - P'!N14=\"\",\"\",'PJ - P'!N14)","v":""},null,{"$f":"IF('PJ - P'!P14=\"\",\"\",'PJ - P'!P14)","v":""}]
[null,{"$f":"IF('PJ - P'!C15=\"\",\"\",'PJ - P'!W15)","v":""},{"$f":"IF('PJ - P'!C15=\"\",\"\",'PJ - P'!B15)","v":""},{"$f":"IF('PJ - P'!C15=\"\",\"\",'PJ - P'!C15)","v":""},{"$f":"IF('PJ - P'!D15=\"\",\"\",'PJ - P'!D15)","v":""},{"$f":"IF('PJ - P'!E15=\"\",\"\",'PJ - P'!E15)","v":""},{"$f":"IF('PJ - P'!I15=\"\",\"\",'PJ - P'!I15)","v":""},{"$f":"IF('PJ - P'!N15=\"\",\"\",'PJ - P'!N15)","v":""},null,{"$f":"IF('PJ - P'!P15=\"\",\"\",'PJ - P'!P15)","v":""}]
[null,{"$f":"IF('PJ - P'!C16=\"\",\"\",'PJ - P'!W16)","v":""},{"$f":"IF('PJ - P'!C16=\"\",\"\",'PJ - P'!B16)","v":""},{"$f":"IF('PJ - P'!C16=\"\",\"\",'PJ - P'!C16)","v":""},{"$f":"IF('PJ - P'!D16=\"\",\"\",'PJ - P'!D16)","v":""},{"$f":"IF('PJ - P'!E16=\"\",\"\",'PJ - P'!E16)","v":""},{"$f":"IF('PJ - P'!I16=\"\",\"\",'PJ - P'!I16)","v":""},{"$f":"IF('PJ - P'!N16=\"\",\"\",'PJ - P'!N16)","v":""},null,{"$f":"IF('PJ - P'!P16=\"\",\"\",'PJ - P'!P16)","v":""}]
[null,{"$f":"IF('PJ - P'!C17=\"\",\"\",'PJ - P'!W17)","v":""},{"$f":"IF('PJ - P'!C17=\"\",\"\",'PJ - P'!B17)","v":""},{"$f":"IF('PJ - P'!C17=\"\",\"\",'PJ - P'!C17)","v":""},{"$f":"IF('PJ - P'!D17=\"\",\"\",'PJ - P'!D17)","v":""},{"$f":"IF('PJ - P'!E17=\"\",\"\",'PJ - P'!E17)","v":""},{"$f":"IF('PJ - P'!I17=\"\",\"\",'PJ - P'!I17)","v":""},{"$f":"IF('PJ - P'!N17=\"\",\"\",'PJ - P'!N17)","v":""},null,{"$f":"IF('PJ - P'!P17=\"\",\"\",'PJ - P'!P17)","v":""}]
[null,{"$f":"IF('PJ - P'!C18=\"\",\"\",'PJ - P'!W18)","v":""},{"$f":"IF('PJ - P'!C18=\"\",\"\",'PJ - P'!B18)","v":""},{"$f":"IF('PJ - P'!C18=\"\",\"\",'PJ - P'!C18)","v":""},{"$f":"IF('PJ - P'!D18=\"\",\"\",'PJ - P'!D18)","v":""},{"$f":"IF('PJ - P'!E18=\"\",\"\",'PJ - P'!E18)","v":""},{"$f":"IF('PJ - P'!I18=\"\",\"\",'PJ - P'!I18)","v":""},{"$f":"IF('PJ - P'!N18=\"\",\"\",'PJ - P'!N18)","v":""},null,{"$f":"IF('PJ - P'!P18=\"\",\"\",'PJ - P'!P18)","v":""}]
[null,{"$f":"IF('PJ - P'!C19=\"\",\"\",'PJ - P'!W19)","v":""},{"$f":"IF('PJ - P'!C19=\"\",\"\",'PJ - P'!B19)","v":""},{"$f":"IF('PJ - P'!C19=\"\",\"\",'PJ - P'!C19)","v":""},{"$f":"IF('PJ - P'!D19=\"\",\"\",'PJ - P'!D19)","v":""},{"$f":"IF('PJ - P'!E19=\"\",\"\",'PJ - P'!E19)","v":""},{"$f":"IF('PJ - P'!I19=\"\",\"\",'PJ - P'!I19)","v":""},{"$f":"IF('PJ - P'!N19=\"\",\"\",'PJ - P'!N19)","v":""},null,{"$f":"IF('PJ - P'!P19=\"\",\"\",'PJ - P'!P19)","v":""}]
[null,{"$f":"IF('PJ - P'!C20=\"\",\"\",'PJ - P'!W20)","v":""},{"$f":"IF('PJ - P'!C20=\"\",\"\",'PJ - P'!B20)","v":""},{"$f":"IF('PJ - P'!C20=\"\",\"\",'PJ - P'!C20)","v":""},{"$f":"IF('PJ - P'!D20=\"\",\"\",'PJ - P'!D20)","v":""},{"$f":"IF('PJ - P'!E20=\"\",\"\",'PJ - P'!E20)","v":""},{"$f":"IF('PJ - P'!I20=\"\",\"\",'PJ - P'!I20)","v":""},{"$f":"IF('PJ - P'!N20=\"\",\"\",'PJ - P'!N20)","v":""},null,{"$f":"IF('PJ - P'!P20=\"\",\"\",'PJ - P'!P20)","v":""}]
[null,{"$f":"IF('PJ - P'!C21=\"\",\"\",'PJ - P'!W21)","v":""},{"$f":"IF('PJ - P'!C21=\"\",\"\",'PJ - P'!B21)","v":""},{"$f":"IF('PJ - P'!C21=\"\",\"\",'PJ - P'!C21)","v":""},{"$f":"IF('PJ - P'!D21=\"\",\"\",'PJ - P'!D21)","v":""},{"$f":"IF('PJ - P'!E21=\"\",\"\",'PJ - P'!E21)","v":""},{"$f":"IF('PJ - P'!I21=\"\",\"\",'PJ - P'!I21)","v":""},{"$f":"IF('PJ - P'!N21=\"\",\"\",'PJ - P'!N21)","v":""},null,{"$f":"IF('PJ - P'!P21=\"\",\"\",'PJ - P'!P21)","v":""}]
[null,{"$f":"IF('PJ - P'!C22=\"\",\"\",'PJ - P'!W22)","v":""},{"$f":"IF('PJ - P'!C22=\"\",\"\",'PJ - P'!B22)","v":""},{"$f":"IF('PJ - P'!C22=\"\",\"\",'PJ - P'!C22)","v":""},{"$f":"IF('PJ - P'!D22=\"\",\"\",'PJ - P'!D22)","v":""},{"$f":"IF('PJ - P'!E22=\"\",\"\",'PJ - P'!E22)","v":""},{"$f":"IF('PJ - P'!I22=\"\",\"\",'PJ - P'!I22)","v":""},{"$f":"IF('PJ - P'!N22=\"\",\"\",'PJ - P'!N22)","v":""},null,{"$f":"IF('PJ - P'!P22=\"\",\"\",'PJ - P'!P22)","v":""}]
[null,{"$f":"IF('PJ - P'!C23=\"\",\"\",'PJ - P'!W23)","v":""},{"$f":"IF('PJ - P'!C23=\"\",\"\",'PJ - P'!B23)","v":""},{"$f":"IF('PJ - P'!C23=\"\",\"\",'PJ - P'!C23)","v":""},{"$f":"IF('PJ - P'!D23=\"\",\"\",'PJ - P'!D23)","v":""},{"$f":"IF('PJ - P'!E23=\"\",\"\",'PJ - P'!E23)","v":""},{"$f":"IF('PJ - P'!I23=\"\",\"\",'PJ - P'!I23)","v":""},{"$f":"IF('PJ - P'!N23=\"\",\"\",'PJ - P'!N23)","v":""},null,{"$f":"IF('PJ - P'!P23=\"\",\"\",'PJ - P'!P23)","v":""}]
[null,{"$f":"IF('PJ - P'!C24=\"\",\"\",'PJ - P'!W24)","v":""},{"$f":"IF('PJ - P'!C24=\"\",\"\",'PJ - P'!B24)","v":""},{"$f":"IF('PJ - P'!C24=\"\",\"\",'PJ - P'!C24)","v":""},{"$f":"IF('PJ - P'!D24=\"\",\"\",'PJ - P'!D24)","v":""},{"$f":"IF('PJ - P'!E24=\"\",\"\",'PJ - P'!E24)","v":""},{"$f":"IF('PJ - P'!I24=\"\",\"\",'PJ - P'!I24)","v":""},{"$f":"IF('PJ - P'!N24=\"\",\"\",'PJ - P'!N24)","v":""},null,{"$f":"IF('PJ - P'!P24=\"\",\"\",'PJ - P'!P24)","v":""}]
[null,{"$f":"IF('PJ - P'!C25=\"\",\"\",'PJ - P'!W25)","v":""},{"$f":"IF('PJ - P'!C25=\"\",\"\",'PJ - P'!B25)","v":""},{"$f":"IF('PJ - P'!C25=\"\",\"\",'PJ - P'!C25)","v":""},{"$f":"IF('PJ - P'!D25=\"\",\"\",'PJ - P'!D25)","v":""},{"$f":"IF('PJ - P'!E25=\"\",\"\",'PJ - P'!E25)","v":""},{"$f":"IF('PJ - P'!I25=\"\",\"\",'PJ - P'!I25)","v":""},{"$f":"IF('PJ - P'!N25=\"\",\"\",'PJ - P'!N25)","v":""},null,{"$f":"IF('PJ - P'!P25=\"\",\"\",'PJ - P'!P25)","v":""}]
[null,{"$f":"IF('PJ - P'!C26=\"\",\"\",'PJ - P'!W26)","v":""},{"$f":"IF('PJ - P'!C26=\"\",\"\",'PJ - P'!B26)","v":""},{"$f":"IF('PJ - P'!C26=\"\",\"\",'PJ - P'!C26)","v":""},{"$f":"IF('PJ - P'!D26=\"\",\"\",'PJ - P'!D26)","v":""},{"$f":"IF('PJ - P'!E26=\"\",\"\",'PJ - P'!E26)","v":""},{"$f":"IF('PJ - P'!I26=\"\",\"\",'PJ - P'!I26)","v":""},{"$f":"IF('PJ - P'!N26=\"\",\"\",'PJ - P'!N26)","v":""},null,{"$f":"IF('PJ - P'!P26=\"\",\"\",'PJ - P'!P26)","v":""}]
[null,{"$f":"IF('PJ - P'!C27=\"\",\"\",'PJ - P'!W27)","v":""},{"$f":"IF('PJ - P'!C27=\"\",\"\",'PJ - P'!B27)","v":""},{"$f":"IF('PJ - P'!C27=\"\",\"\",'PJ - P'!C27)","v":""},{"$f":"IF('PJ - P'!D27=\"\",\"\",'PJ - P'!D27)","v":""},{"$f":"IF('PJ - P'!E27=\"\",\"\",'PJ - P'!E27)","v":""},{"$f":"IF('PJ - P'!I27=\"\",\"\",'PJ - P'!I27)","v":""},{"$f":"IF('PJ - P'!N27=\"\",\"\",'PJ - P'!N27)","v":""},null,{"$f":"IF('PJ - P'!P27=\"\",\"\",'PJ - P'!P27)","v":""}]
[null,{"$f":"IF('PJ - P'!C28=\"\",\"\",'PJ - P'!W28)","v":""},{"$f":"IF('PJ - P'!C28=\"\",\"\",'PJ - P'!B28)","v":""},{"$f":"IF('PJ - P'!C28=\"\",\"\",'PJ - P'!C28)","v":""},{"$f":"IF('PJ - P'!D28=\"\",\"\",'PJ - P'!D28)","v":""},{"$f":"IF('PJ - P'!E28=\"\",\"\",'PJ - P'!E28)","v":""},{"$f":"IF('PJ - P'!I28=\"\",\"\",'PJ - P'!I28)","v":""},{"$f":"IF('PJ - P'!N28=\"\",\"\",'PJ - P'!N28)","v":""},null,{"$f":"IF('PJ - P'!P28=\"\",\"\",'PJ - P'!P28)","v":""}]
[null,{"$f":"IF('PJ - P'!C29=\"\",\"\",'PJ - P'!W29)","v":""},{"$f":"IF('PJ - P'!C29=\"\",\"\",'PJ - P'!B29)","v":""},{"$f":"IF('PJ - P'!C29=\"\",\"\",'PJ - P'!C29)","v":""},{"$f":"IF('PJ - P'!D29=\"\",\"\",'PJ - P'!D29)","v":""},{"$f":"IF('PJ - P'!E29=\"\",\"\",'PJ - P'!E29)","v":""},{"$f":"IF('PJ - P'!I29=\"\",\"\",'PJ - P'!I29)","v":""},{"$f":"IF('PJ - P'!N29=\"\",\"\",'PJ - P'!N29)","v":""},null,{"$f":"IF('PJ - P'!P29=\"\",\"\",'PJ - P'!P29)","v":""}]
[null,{"$f":"IF('PJ - P'!C30=\"\",\"\",'PJ - P'!W30)","v":""},{"$f":"IF('PJ - P'!C30=\"\",\"\",'PJ - P'!B30)","v":""},{"$f":"IF('PJ - P'!C30=\"\",\"\",'PJ - P'!C30)","v":""},{"$f":"IF('PJ - P'!D30=\"\",\"\",'PJ - P'!D30)","v":""},{"$f":"IF('PJ - P'!E30=\"\",\"\",'PJ - P'!E30)","v":""},{"$f":"IF('PJ - P'!I30=\"\",\"\",'PJ - P'!I30)","v":""},{"$f":"IF('PJ - P'!N30=\"\",\"\",'PJ - P'!N30)","v":""},null,{"$f":"IF('PJ - P'!P30=\"\",\"\",'PJ - P'!P30)","v":""}]
[null,{"$f":"IF('PJ - P'!C31=\"\",\"\",'PJ - P'!W31)","v":""},{"$f":"IF('PJ - P'!C31=\"\",\"\",'PJ - P'!B31)","v":""},{"$f":"IF('PJ - P'!C31=\"\",\"\",'PJ - P'!C31)","v":""},{"$f":"IF('PJ - P'!D31=\"\",\"\",'PJ - P'!D31)","v":""},{"$f":"IF('PJ - P'!E31=\"\",\"\",'PJ - P'!E31)","v":""},{"$f":"IF('PJ - P'!I31=\"\",\"\",'PJ - P'!I31)","v":""},{"$f":"IF('PJ - P'!N31=\"\",\"\",'PJ - P'!N31)","v":""},null,{"$f":"IF('PJ - P'!P31=\"\",\"\",'PJ - P'!P31)","v":""}]
[null,{"$f":"IF('PJ - P'!C32=\"\",\"\",'PJ - P'!W32)","v":""},{"$f":"IF('PJ - P'!C32=\"\",\"\",'PJ - P'!B32)","v":""},{"$f":"IF('PJ - P'!C32=\"\",\"\",'PJ - P'!C32)","v":""},{"$f":"IF('PJ - P'!D32=\"\",\"\",'PJ - P'!D32)","v":""},{"$f":"IF('PJ - P'!E32=\"\",\"\",'PJ - P'!E32)","v":""},{"$f":"IF('PJ - P'!I32=\"\",\"\",'PJ - P'!I32)","v":""},{"$f":"IF('PJ - P'!N32=\"\",\"\",'PJ - P'!N32)","v":""},null,{"$f":"IF('PJ - P'!P32=\"\",\"\",'PJ - P'!P32)","v":""}]
[null,{"$f":"IF('PJ - P'!C33=\"\",\"\",'PJ - P'!W33)","v":""},{"$f":"IF('PJ - P'!C33=\"\",\"\",'PJ - P'!B33)","v":""},{"$f":"IF('PJ - P'!C33=\"\",\"\",'PJ - P'!C33)","v":""},{"$f":"IF('PJ - P'!D33=\"\",\"\",'PJ - P'!D33)","v":""},{"$f":"IF('PJ - P'!E33=\"\",\"\",'PJ - P'!E33)","v":""},{"$f":"IF('PJ - P'!I33=\"\",\"\",'PJ - P'!I33)","v":""},{"$f":"IF('PJ - P'!N33=\"\",\"\",'PJ - P'!N33)","v":""},null,{"$f":"IF('PJ - P'!P33=\"\",\"\",'PJ - P'!P33)","v":""}]
[null,{"$f":"IF('PJ - P'!C34=\"\",\"\",'PJ - P'!W34)","v":""},{"$f":"IF('PJ - P'!C34=\"\",\"\",'PJ - P'!B34)","v":""},{"$f":"IF('PJ - P'!C34=\"\",\"\",'PJ - P'!C34)","v":""},{"$f":"IF('PJ - P'!D34=\"\",\"\",'PJ - P'!D34)","v":""},{"$f":"IF('PJ - P'!E34=\"\",\"\",'PJ - P'!E34)","v":""},{"$f":"IF('PJ - P'!I34=\"\",\"\",'PJ - P'!I34)","v":""},{"$f":"IF('PJ - P'!N34=\"\",\"\",'PJ - P'!N34)","v":""},null,{"$f":"IF('PJ - P'!P34=\"\",\"\",'PJ - P'!P34)","v":""}]
[null,{"$f":"IF('PJ - P'!C35=\"\",\"\",'PJ - P'!W35)","v":""},{"$f":"IF('PJ - P'!C35=\"\",\"\",'PJ - P'!B35)","v":""},{"$f":"IF('PJ - P'!C35=\"\",\"\",'PJ - P'!C35)","v":""},{"$f":"IF('PJ - P'!D35=\"\",\"\",'PJ - P'!D35)","v":""},{"$f":"IF('PJ - P'!E35=\"\",\"\",'PJ - P'!E35)","v":""},{"$f":"IF('PJ - P'!I35=\"\",\"\",'PJ - P'!I35)","v":""},{"$f":"IF('PJ - P'!N35=\"\",\"\",'PJ - P'!N35)","v":""},null,{"$f":"IF('PJ - P'!P35=\"\",\"\",'PJ - P'!P35)","v":""}]
[null,{"$f":"IF('PJ - P'!C36=\"\",\"\",'PJ - P'!W36)","v":""},{"$f":"IF('PJ - P'!C36=\"\",\"\",'PJ - P'!B36)","v":""},{"$f":"IF('PJ - P'!C36=\"\",\"\",'PJ - P'!C36)","v":""},{"$f":"IF('PJ - P'!D36=\"\",\"\",'PJ - P'!D36)","v":""},{"$f":"IF('PJ - P'!E36=\"\",\"\",'PJ - P'!E36)","v":""},{"$f":"IF('PJ - P'!I36=\"\",\"\",'PJ - P'!I36)","v":""},{"$f":"IF('PJ - P'!N36=\"\",\"\",'PJ - P'!N36)","v":""},null,{"$f":"IF('PJ - P'!P36=\"\",\"\",'PJ - P'!P36)","v":""}]
[null,{"$f":"IF('PJ - P'!C37=\"\",\"\",'PJ - P'!W37)","v":""},{"$f":"IF('PJ - P'!C37=\"\",\"\",'PJ - P'!B37)","v":""},{"$f":"IF('PJ - P'!C37=\"\",\"\",'PJ - P'!C37)","v":""},{"$f":"IF('PJ - P'!D37=\"\",\"\",'PJ - P'!D37)","v":""},{"$f":"IF('PJ - P'!E37=\"\",\"\",'PJ - P'!E37)","v":""},{"$f":"IF('PJ - P'!I37=\"\",\"\",'PJ - P'!I37)","v":""},{"$f":"IF('PJ - P'!N37=\"\",\"\",'PJ - P'!N37)","v":""},null,{"$f":"IF('PJ - P'!P37=\"\",\"\",'PJ - P'!P37)","v":""}]
[null,{"$f":"IF('PJ - P'!C38=\"\",\"\",'PJ - P'!W38)","v":""},{"$f":"IF('PJ - P'!C38=\"\",\"\",'PJ - P'!B38)","v":""},{"$f":"IF('PJ - P'!C38=\"\",\"\",'PJ - P'!C38)","v":""},{"$f":"IF('PJ - P'!D38=\"\",\"\",'PJ - P'!D38)","v":""},{"$f":"IF('PJ - P'!E38=\"\",\"\",'PJ - P'!E38)","v":""},{"$f":"IF('PJ - P'!I38=\"\",\"\",'PJ - P'!I38)","v":""},{"$f":"IF('PJ - P'!N38=\"\",\"\",'PJ - P'!N38)","v":""},null,{"$f":"IF('PJ - P'!P38=\"\",\"\",'PJ - P'!P38)","v":""}]
[null,{"$f":"IF('PJ - P'!C39=\"\",\"\",'PJ - P'!W39)","v":""},{"$f":"IF('PJ - P'!C39=\"\",\"\",'PJ - P'!B39)","v":""},{"$f":"IF('PJ - P'!C39=\"\",\"\",'PJ - P'!C39)","v":""},{"$f":"IF('PJ - P'!D39=\"\",\"\",'PJ - P'!D39)","v":""},{"$f":"IF('PJ - P'!E39=\"\",\"\",'PJ - P'!E39)","v":""},{"$f":"IF('PJ - P'!I39=\"\",\"\",'PJ - P'!I39)","v":""},{"$f":"IF('PJ - P'!N39=\"\",\"\",'PJ - P'!N39)","v":""},null,{"$f":"IF('PJ - P'!P39=\"\",\"\",'PJ - P'!P39)","v":""}]
[null,{"$f":"IF('PJ - P'!C40=\"\",\"\",'PJ - P'!W40)","v":""},{"$f":"IF('PJ - P'!C40=\"\",\"\",'PJ - P'!B40)","v":""},{"$f":"IF('PJ - P'!C40=\"\",\"\",'PJ - P'!C40)","v":""},{"$f":"IF('PJ - P'!D40=\"\",\"\",'PJ - P'!D40)","v":""},{"$f":"IF('PJ - P'!E40=\"\",\"\",'PJ - P'!E40)","v":""},{"$f":"IF('PJ - P'!I40=\"\",\"\",'PJ - P'!I40)","v":""},{"$f":"IF('PJ - P'!N40=\"\",\"\",'PJ - P'!N40)","v":""},null,{"$f":"IF('PJ - P'!P40=\"\",\"\",'PJ - P'!P40)","v":""}]
[null,{"$f":"IF('PJ - P'!C41=\"\",\"\",'PJ - P'!W41)","v":""},{"$f":"IF('PJ - P'!C41=\"\",\"\",'PJ - P'!B41)","v":""},{"$f":"IF('PJ - P'!C41=\"\",\"\",'PJ - P'!C41)","v":""},{"$f":"IF('PJ - P'!D41=\"\",\"\",'PJ - P'!D41)","v":""},{"$f":"IF('PJ - P'!E41=\"\",\"\",'PJ - P'!E41)","v":""},{"$f":"IF('PJ - P'!I41=\"\",\"\",'PJ - P'!I41)","v":""},{"$f":"IF('PJ - P'!N41=\"\",\"\",'PJ - P'!N41)","v":""},null,{"$f":"IF('PJ - P'!P41=\"\",\"\",'PJ - P'!P41)","v":""}]
[null,{"$f":"IF('PJ - P'!C42=\"\",\"\",'PJ - P'!W42)","v":""},{"$f":"IF('PJ - P'!C42=\"\",\"\",'PJ - P'!B42)","v":""},{"$f":"IF('PJ - P'!C42=\"\",\"\",'PJ - P'!C42)","v":""},{"$f":"IF('PJ - P'!D42=\"\",\"\",'PJ - P'!D42)","v":""},{"$f":"IF('PJ - P'!E42=\"\",\"\",'PJ - P'!E42)","v":""},{"$f":"IF('PJ - P'!I42=\"\",\"\",'PJ - P'!I42)","v":""},{"$f":"IF('PJ - P'!N42=\"\",\"\",'PJ - P'!N42)","v":""},null,{"$f":"IF('PJ - P'!P42=\"\",\"\",'PJ - P'!P42)","v":""}]
[null,{"$f":"IF('PJ - P'!C43=\"\",\"\",'PJ - P'!W43)","v":""},{"$f":"IF('PJ - P'!C43=\"\",\"\",'PJ - P'!B43)","v":""},{"$f":"IF('PJ - P'!C43=\"\",\"\",'PJ - P'!C43)","v":""},{"$f":"IF('PJ - P'!D43=\"\",\"\",'PJ - P'!D43)","v":""},{"$f":"IF('PJ - P'!E43=\"\",\"\",'PJ - P'!E43)","v":""},{"$f":"IF('PJ - P'!I43=\"\",\"\",'PJ - P'!I43)","v":""},{"$f":"IF('PJ - P'!N43=\"\",\"\",'PJ - P'!N43)","v":""},null,{"$f":"IF('PJ - P'!P43=\"\",\"\",'PJ - P'!P43)","v":""}]
[null,{"$f":"IF('PJ - P'!C44=\"\",\"\",'PJ - P'!W44)","v":""},{"$f":"IF('PJ - P'!C44=\"\",\"\",'PJ - P'!B44)","v":""},{"$f":"IF('PJ - P'!C44=\"\",\"\",'PJ - P'!C44)","v":""},{"$f":"IF('PJ - P'!D44=\"\",\"\",'PJ - P'!D44)","v":""},{"$f":"IF('PJ - P'!E44=\"\",\"\",'PJ - P'!E44)","v":""},{"$f":"IF('PJ - P'!I44=\"\",\"\",'PJ - P'!I44)","v":""},{"$f":"IF('PJ - P'!N44=\"\",\"\",'PJ - P'!N44)","v":""},null,{"$f":"IF('PJ - P'!P44=\"\",\"\",'PJ - P'!P44)","v":""}]
[null,{"$f":"IF('PJ - P'!C45=\"\",\"\",'PJ - P'!W45)","v":""},{"$f":"IF('PJ - P'!C45=\"\",\"\",'PJ - P'!B45)","v":""},{"$f":"IF('PJ - P'!C45=\"\",\"\",'PJ - P'!C45)","v":""},{"$f":"IF('PJ - P'!D45=\"\",\"\",'PJ - P'!D45)","v":""},{"$f":"IF('PJ - P'!E45=\"\",\"\",'PJ - P'!E45)","v":""},{"$f":"IF('PJ - P'!I45=\"\",\"\",'PJ - P'!I45)","v":""},{"$f":"IF('PJ - P'!N45=\"\",\"\",'PJ - P'!N45)","v":""},null,{"$f":"IF('PJ - P'!P45=\"\",\"\",'PJ - P'!P45)","v":""}]
[null,{"$f":"IF('PJ - P'!C46=\"\",\"\",'PJ - P'!W46)","v":""},{"$f":"IF('PJ - P'!C46=\"\",\"\",'PJ - P'!B46)","v":""},{"$f":"IF('PJ - P'!C46=\"\",\"\",'PJ - P'!C46)","v":""},{"$f":"IF('PJ - P'!D46=\"\",\"\",'PJ - P'!D46)","v":""},{"$f":"IF('PJ - P'!E46=\"\",\"\",'PJ - P'!E46)","v":""},{"$f":"IF('PJ - P'!I46=\"\",\"\",'PJ - P'!I46)","v":""},{"$f":"IF('PJ - P'!N46=\"\",\"\",'PJ - P'!N46)","v":""},null,{"$f":"IF('PJ - P'!P46=\"\",\"\",'PJ - P'!P46)","v":""}]
[null,{"$f":"IF('PJ - P'!C47=\"\",\"\",'PJ - P'!W47)","v":""},{"$f":"IF('PJ - P'!C47=\"\",\"\",'PJ - P'!B47)","v":""},{"$f":"IF('PJ - P'!C47=\"\",\"\",'PJ - P'!C47)","v":""},{"$f":"IF('PJ - P'!D47=\"\",\"\",'PJ - P'!D47)","v":""},{"$f":"IF('PJ - P'!E47=\"\",\"\",'PJ - P'!E47)","v":""},{"$f":"IF('PJ - P'!I47=\"\",\"\",'PJ - P'!I47)","v":""},{"$f":"IF('PJ - P'!N47=\"\",\"\",'PJ - P'!N47)","v":""},null,{"$f":"IF('PJ - P'!P47=\"\",\"\",'PJ - P'!P47)","v":""}]
[null,{"$f":"IF('PJ - P'!C48=\"\",\"\",'PJ - P'!W48)","v":""},{"$f":"IF('PJ - P'!C48=\"\",\"\",'PJ - P'!B48)","v":""},{"$f":"IF('PJ - P'!C48=\"\",\"\",'PJ - P'!C48)","v":""},{"$f":"IF('PJ - P'!D48=\"\",\"\",'PJ - P'!D48)","v":""},{"$f":"IF('PJ - P'!E48=\"\",\"\",'PJ - P'!E48)","v":""},{"$f":"IF('PJ - P'!I48=\"\",\"\",'PJ - P'!I48)","v":""},{"$f":"IF('PJ - P'!N48=\"\",\"\",'PJ - P'!N48)","v":""},null,{"$f":"IF('PJ - P'!P48=\"\",\"\",'PJ - P'!P48)","v":""}]
[null,{"$f":"IF('PJ - P'!C49=\"\",\"\",'PJ - P'!W49)","v":""},{"$f":"IF('PJ - P'!C49=\"\",\"\",'PJ - P'!B49)","v":""},{"$f":"IF('PJ - P'!C49=\"\",\"\",'PJ - P'!C49)","v":""},{"$f":"IF('PJ - P'!D49=\"\",\"\",'PJ - P'!D49)","v":""},{"$f":"IF('PJ - P'!E49=\"\",\"\",'PJ - P'!E49)","v":""},{"$f":"IF('PJ - P'!I49=\"\",\"\",'PJ - P'!I49)","v":""},{"$f":"IF('PJ - P'!N49=\"\",\"\",'PJ - P'!N49)","v":""},null,{"$f":"IF('PJ - P'!P49=\"\",\"\",'PJ - P'!P49)","v":""}]
[null,{"$f":"IF('PJ - P'!C50=\"\",\"\",'PJ - P'!W50)","v":""},{"$f":"IF('PJ - P'!C50=\"\",\"\",'PJ - P'!B50)","v":""},{"$f":"IF('PJ - P'!C50=\"\",\"\",'PJ - P'!C50)","v":""},{"$f":"IF('PJ - P'!D50=\"\",\"\",'PJ - P'!D50)","v":""},{"$f":"IF('PJ - P'!E50=\"\",\"\",'PJ - P'!E50)","v":""},{"$f":"IF('PJ - P'!I50=\"\",\"\",'PJ - P'!I50)","v":""},{"$f":"IF('PJ - P'!N50=\"\",\"\",'PJ - P'!N50)","v":""},null,{"$f":"IF('PJ - P'!P50=\"\",\"\",'PJ - P'!P50)","v":""}]

{"sheet":"DV-S","index":9,"n_rows":54,"n_cols":16,"rows_kept":54,"cut":false,"hidden":false,"merged":[[0,1,0,15],[2,5,2,8],[2,11,2,14]]}
[null,"Dvojboj - J - Startovní listina"]
[]
[null,null,"Dorky či Dorci",null,null,"I. pokus",null,null,null,null,null,"II. pokus"]
[null,"st.č.","Jméno","SDH","Okres",1,2,3,"Čas","dr.",null,1,2,3,"Čas","dr."]
[null,"1",{"$f":"IF(Start!D7=\"\",\"\",Start!D7)","v":"Klára Trmotová"},{"$f":"IF(Start!E7=\"\",\"\",Start!E7)","v":"Dlažov"},{"$f":"IF(Start!F7=\"\",\"\",Start!F7)","v":"KT"},null,null,null,null,"1",null,null,null,null,null,"2"]
[null,"2",{"$f":"IF(Start!D8=\"\",\"\",Start!D8)","v":"Tereza Grünerová "},{"$f":"IF(Start!E8=\"\",\"\",Start!E8)","v":"Brod nad Tichou"},{"$f":"IF(Start!F8=\"\",\"\",Start!F8)","v":"TA"},null,null,null,null,"2",null,null,null,null,null,"1"]
[null,"3",{"$f":"IF(Start!D9=\"\",\"\",Start!D9)","v":"Iva Babková"},{"$f":"IF(Start!E9=\"\",\"\",Start!E9)","v":"Bystřice nad Úhlavou"},{"$f":"IF(Start!F9=\"\",\"\",Start!F9)","v":"KT"},null,null,null,null,"1",null,null,null,null,null,"2"]
[null,"4",{"$f":"IF(Start!D10=\"\",\"\",Start!D10)","v":"Michaela Marešová"},{"$f":"IF(Start!E10=\"\",\"\",Start!E10)","v":"Planá"},{"$f":"IF(Start!F10=\"\",\"\",Start!F10)","v":"TA"},null,null,null,null,"2",null,null,null,null,null,"1"]
[null,"5",{"$f":"IF(Start!D11=\"\",\"\",Start!D11)","v":"Adéla Stodolová"},{"$f":"IF(Start!E11=\"\",\"\",Start!E11)","v":"Planá"},{"$f":"IF(Start!F11=\"\",\"\",Start!F11)","v":"TA"},null,null,null,null,"1",null,null,null,null,null,"2"]
[null,"6",{"$f":"IF(Start!D12=\"\",\"\",Start!D12)","v":""},{"$f":"IF(Start!E12=\"\",\"\",Start!E12)","v":""},{"$f":"IF(Start!F12=\"\",\"\",Start!F12)","v":""},null,null,null,null,"2",null,null,null,null,null,"1"]
[null,"7",{"$f":"IF(Start!D13=\"\",\"\",Start!D13)","v":""},{"$f":"IF(Start!E13=\"\",\"\",Start!E13)","v":""},{"$f":"IF(Start!F13=\"\",\"\",Start!F13)","v":""},null,null,null,null,"1",null,null,null,null,null,"2"]
[null,"8",{"$f":"IF(Start!D14=\"\",\"\",Start!D14)","v":""},{"$f":"IF(Start!E14=\"\",\"\",Start!E14)","v":""},{"$f":"IF(Start!F14=\"\",\"\",Start!F14)","v":""},null,null,null,null,"2",null,null,null,null,null,"1"]
[null,"9",{"$f":"IF(Start!D15=\"\",\"\",Start!D15)","v":""},{"$f":"IF(Start!E15=\"\",\"\",Start!E15)","v":""},{"$f":"IF(Start!F15=\"\",\"\",Start!F15)","v":""},null,null,null,null,"1",null,null,null,null,null,"2"]
[null,"10",{"$f":"IF(Start!D16=\"\",\"\",Start!D16)","v":""},{"$f":"IF(Start!E16=\"\",\"\",Start!E16)","v":""},{"$f":"IF(Start!F16=\"\",\"\",Start!F16)","v":""},null,null,null,null,"2",null,null,null,null,null,"1"]
[null,"11",{"$f":"IF(Start!D17=\"\",\"\",Start!D17)","v":""},{"$f":"IF(Start!E17=\"\",\"\",Start!E17)","v":""},{"$f":"IF(Start!F17=\"\",\"\",Start!F17)","v":""},null,null,null,null,"1",null,null,null,null,null,"2"]
[null,"12",{"$f":"IF(Start!D18=\"\",\"\",Start!D18)","v":""},{"$f":"IF(Start!E18=\"\",\"\",Start!E18)","v":""},{"$f":"IF(Start!F18=\"\",\"\",Start!F18)","v":""},null,null,null,null,"2",null,null,null,null,null,"1"]
[null,"13",{"$f":"IF(Start!D19=\"\",\"\",Start!D19)","v":""},{"$f":"IF(Start!E19=\"\",\"\",Start!E19)","v":""},{"$f":"IF(Start!F19=\"\",\"\",Start!F19)","v":""},null,null,null,null,"1",null,null,null,null,null,"2"]
[null,"14",{"$f":"IF(Start!D20=\"\",\"\",Start!D20)","v":""},{"$f":"IF(Start!E20=\"\",\"\",Start!E20)","v":""},{"$f":"IF(Start!F20=\"\",\"\",Start!F20)","v":""},null,null,null,null,"2",null,null,null,null,null,"1"]
[null,"15",{"$f":"IF(Start!D21=\"\",\"\",Start!D21)","v":""},{"$f":"IF(Start!E21=\"\",\"\",Start!E21)","v":""},{"$f":"IF(Start!F21=\"\",\"\",Start!F21)","v":""},null,null,null,null,"1",null,null,null,null,null,"2"]
[null,"16",{"$f":"IF(Start!D22=\"\",\"\",Start!D22)","v":""},{"$f":"IF(Start!E22=\"\",\"\",Start!E22)","v":""},{"$f":"IF(Start!F22=\"\",\"\",Start!F22)","v":""},null,null,null,null,"2",null,null,null,null,null,"1"]
[null,"17",{"$f":"IF(Start!D23=\"\",\"\",Start!D23)","v":""},{"$f":"IF(Start!E23=\"\",\"\",Start!E23)","v":""},{"$f":"IF(Start!F23=\"\",\"\",Start!F23)","v":""},null,null,null,null,"1",null,null,null,null,null,"2"]
[null,"18",{"$f":"IF(Start!D24=\"\",\"\",Start!D24)","v":""},{"$f":"IF(Start!E24=\"\",\"\",Start!E24)","v":""},{"$f":"IF(Start!F24=\"\",\"\",Start!F24)","v":""},null,null,null,null,"2",null,null,null,null,null,"1"]
[null,"19",{"$f":"IF(Start!D25=\"\",\"\",Start!D25)","v":""},{"$f":"IF(Start!E25=\"\",\"\",Start!E25)","v":""},{"$f":"IF(Start!F25=\"\",\"\",Start!F25)","v":""},null,null,null,null,"1",null,null,null,null,null,"2"]
[null,"20",{"$f":"IF(Start!D26=\"\",\"\",Start!D26)","v":""},{"$f":"IF(Start!E26=\"\",\"\",Start!E26)","v":""},{"$f":"IF(Start!F26=\"\",\"\",Start!F26)","v":""},null,null,null,null,"2",null,null,null,null,null,"1"]
[null,"21",{"$f":"IF(Start!D27=\"\",\"\",Start!D27)","v":""},{"$f":"IF(Start!E27=\"\",\"\",Start!E27)","v":""},{"$f":"IF(Start!F27=\"\",\"\",Start!F27)","v":""},null,null,null,null,"1",null,null,null,null,null,"2"]
[null,"22",{"$f":"IF(Start!D28=\"\",\"\",Start!D28)","v":""},{"$f":"IF(Start!E28=\"\",\"\",Start!E28)","v":""},{"$f":"IF(Start!F28=\"\",\"\",Start!F28)","v":""},null,null,null,null,"2",null,null,null,null,null,"1"]
[null,"23",{"$f":"IF(Start!D29=\"\",\"\",Start!D29)","v":""},{"$f":"IF(Start!E29=\"\",\"\",Start!E29)","v":""},{"$f":"IF(Start!F29=\"\",\"\",Start!F29)","v":""},null,null,null,null,"1",null,null,null,null,null,"2"]
[null,"24",{"$f":"IF(Start!D30=\"\",\"\",Start!D30)","v":""},{"$f":"IF(Start!E30=\"\",\"\",Start!E30)","v":""},{"$f":"IF(Start!F30=\"\",\"\",Start!F30)","v":""},null,null,null,null,"2",null,null,null,null,null,"1"]
[null,"25",{"$f":"IF(Start!D31=\"\",\"\",Start!D31)","v":""},{"$f":"IF(Start!E31=\"\",\"\",Start!E31)","v":""},{"$f":"IF(Start!F31=\"\",\"\",Start!F31)","v":""},null,null,null,null,"1",null,null,null,null,null,"2"]
[null,"26",{"$f":"IF(Start!D32=\"\",\"\",Start!D32)","v":""},{"$f":"IF(Start!E32=\"\",\"\",Start!E32)","v":""},{"$f":"IF(Start!F32=\"\",\"\",Start!F32)","v":""},null,null,null,null,"2",null,null,null,null,null,"1"]
[null,"27",{"$f":"IF(Start!D33=\"\",\"\",Start!D33)","v":""},{"$f":"IF(Start!E33=\"\",\"\",Start!E33)","v":""},{"$f":"IF(Start!F33=\"\",\"\",Start!F33)","v":""},null,null,null,null,"1",null,null,null,null,null,"2"]
[null,"28",{"$f":"IF(Start!D34=\"\",\"\",Start!D34)","v":""},{"$f":"IF(Start!E34=\"\",\"\",Start!E34)","v":""},{"$f":"IF(Start!F34=\"\",\"\",Start!F34)","v":""},null,null,null,null,"2",null,null,null,null,null,"1"]
[null,"29",{"$f":"IF(Start!D35=\"\",\"\",Start!D35)","v":""},{"$f":"IF(Start!E35=\"\",\"\",Start!E35)","v":""},{"$f":"IF(Start!F35=\"\",\"\",Start!F35)","v":""},null,null,null,null,"1",null,null,null,null,null,"2"]
[null,"30",{"$f":"IF(Start!D36=\"\",\"\",Start!D36)","v":""},{"$f":"IF(Start!E36=\"\",\"\",Start!E36)","v":""},{"$f":"IF(Start!F36=\"\",\"\",Start!F36)","v":""},null,null,null,null,"2",null,null,null,null,null,"1"]
[null,"31",{"$f":"IF(Start!D37=\"\",\"\",Start!D37)","v":""},{"$f":"IF(Start!E37=\"\",\"\",Start!E37)","v":""},{"$f":"IF(Start!F37=\"\",\"\",Start!F37)","v":""},null,null,null,null,"1",null,null,null,null,null,"2"]
[null,"32",{"$f":"IF(Start!D38=\"\",\"\",Start!D38)","v":""},{"$f":"IF(Start!E38=\"\",\"\",Start!E38)","v":""},{"$f":"IF(Start!F38=\"\",\"\",Start!F38)","v":""},null,null,null,null,"2",null,null,null,null,null,"1"]
[null,"33",{"$f":"IF(Start!D39=\"\",\"\",Start!D39)","v":""},{"$f":"IF(Start!E39=\"\",\"\",Start!E39)","v":""},{"$f":"IF(Start!F39=\"\",\"\",Start!F39)","v":""},null,null,null,null,"1",null,null,null,null,null,"2"]
[null,"34",{"$f":"IF(Start!D40=\"\",\"\",Start!D40)","v":""},{"$f":"IF(Start!E40=\"\",\"\",Start!E40)","v":""},{"$f":"IF(Start!F40=\"\",\"\",Start!F40)","v":""},null,null,null,null,"2",null,null,null,null,null,"1"]
[null,"35",{"$f":"IF(Start!D41=\"\",\"\",Start!D41)","v":""},{"$f":"IF(Start!E41=\"\",\"\",Start!E41)","v":""},{"$f":"IF(Start!F41=\"\",\"\",Start!F41)","v":""},null,null,null,null,"1",null,null,null,null,null,"2"]
[null,"36",{"$f":"IF(Start!D42=\"\",\"\",Start!D42)","v":""},{"$f":"IF(Start!E42=\"\",\"\",Start!E42)","v":""},{"$f":"IF(Start!F42=\"\",\"\",Start!F42)","v":""},null,null,null,null,"2",null,null,null,null,null,"1"]
[null,"37",{"$f":"IF(Start!D43=\"\",\"\",Start!D43)","v":""},{"$f":"IF(Start!E43=\"\",\"\",Start!E43)","v":""},{"$f":"IF(Start!F43=\"\",\"\",Start!F43)","v":""},null,null,null,null,"1",null,null,null,null,null,"2"]
[null,"38",{"$f":"IF(Start!D44=\"\",\"\",Start!D44)","v":""},{"$f":"IF(Start!E44=\"\",\"\",Start!E44)","v":""},{"$f":"IF(Start!F44=\"\",\"\",Start!F44)","v":""},null,null,null,null,"2",null,null,null,null,null,"1"]
[null,"39",{"$f":"IF(Start!D45=\"\",\"\",Start!D45)","v":""},{"$f":"IF(Start!E45=\"\",\"\",Start!E45)","v":""},{"$f":"IF(Start!F45=\"\",\"\",Start!F45)","v":""},null,null,null,null,"1",null,null,null,null,null,"2"]
[null,"40",{"$f":"IF(Start!D46=\"\",\"\",Start!D46)","v":""},{"$f":"IF(Start!E46=\"\",\"\",Start!E46)","v":""},{"$f":"IF(Start!F46=\"\",\"\",Start!F46)","v":""},null,null,null,null,"2",null,null,null,null,null,"1"]
[null,"41",{"$f":"IF(Start!D47=\"\",\"\",Start!D47)","v":""},{"$f":"IF(Start!E47=\"\",\"\",Start!E47)","v":""},{"$f":"IF(Start!F47=\"\",\"\",Start!F47)","v":""},null,null,null,null,"1",null,null,null,null,null,"2"]
[null,"42",{"$f":"IF(Start!D48=\"\",\"\",Start!D48)","v":""},{"$f":"IF(Start!E48=\"\",\"\",Start!E48)","v":""},{"$f":"IF(Start!F48=\"\",\"\",Start!F48)","v":""},null,null,null,null,"2",null,null,null,null,null,"1"]
[null,"43",{"$f":"IF(Start!D49=\"\",\"\",Start!D49)","v":""},{"$f":"IF(Start!E49=\"\",\"\",Start!E49)","v":""},{"$f":"IF(Start!F49=\"\",\"\",Start!F49)","v":""},null,null,null,null,"1",null,null,null,null,null,"2"]
[null,"44",{"$f":"IF(Start!D50=\"\",\"\",Start!D50)","v":""},{"$f":"IF(Start!E50=\"\",\"\",Start!E50)","v":""},{"$f":"IF(Start!F50=\"\",\"\",Start!F50)","v":""},null,null,null,null,"2",null,null,null,null,null,"1"]
[null,"45",{"$f":"IF(Start!D51=\"\",\"\",Start!D51)","v":""},{"$f":"IF(Start!E51=\"\",\"\",Start!E51)","v":""},{"$f":"IF(Start!F51=\"\",\"\",Start!F51)","v":""},null,null,null,null,"1",null,null,null,null,null,"2"]
[null,"46",{"$f":"IF(Start!D52=\"\",\"\",Start!D52)","v":""},{"$f":"IF(Start!E52=\"\",\"\",Start!E52)","v":""},{"$f":"IF(Start!F52=\"\",\"\",Start!F52)","v":""},null,null,null,null,"2",null,null,null,null,null,"1"]
[null,"47",{"$f":"IF(Start!D53=\"\",\"\",Start!D53)","v":""},{"$f":"IF(Start!E53=\"\",\"\",Start!E53)","v":""},{"$f":"IF(Start!F53=\"\",\"\",Start!F53)","v":""},null,null,null,null,"1",null,null,null,null,null,"2"]
[null,"48",{"$f":"IF(Start!D54=\"\",\"\",Start!D54)","v":""},{"$f":"IF(Start!E54=\"\",\"\",Start!E54)","v":""},{"$f":"IF(Start!F54=\"\",\"\",Start!F54)","v":""},null,null,null,null,"2",null,null,null,null,null,"1"]
[null,"49",{"$f":"IF(Start!D55=\"\",\"\",Start!D55)","v":""},{"$f":"IF(Start!E55=\"\",\"\",Start!E55)","v":""},{"$f":"IF(Start!F55=\"\",\"\",Start!F55)","v":""},null,null,null,null,"1",null,null,null,null,null,"2"]
[null,"50",{"$f":"IF(Start!D56=\"\",\"\",Start!D56)","v":""},{"$f":"IF(Start!E56=\"\",\"\",Start!E56)","v":""},{"$f":"IF(Start!F56=\"\",\"\",Start!F56)","v":""},null,null,null,null,"2",null,null,null,null,null,"1"]

{"sheet":"DV-V","index":10,"n_rows":54,"n_cols":23,"rows_kept":54,"cut":false,"hidden":false,"merged":[[0,1,0,16],[2,6,2,9],[2,11,2,14]]}
[null,"Dvojboj - J - Zadání výsledků"]
[]
[null,null,null,{"$f":"Start!$D$5","v":"Dorky - Střední"},null,null,"I.",null,null,null,null,"II."]
[null,"Poř.","St.č.","Jméno","SDH",{"$f":"Start!$F$6","v":"Okres"},1,2,3,"Čas",null,1,2,3,"Čas",null,"C.",null,"P.",null,"B.",null,"X."]
[null,1,{"$f":"IF(Start!C7=\"\",\"\",Start!C7)","v":1},{"$f":"IF(Start!D7=\"\",\"\",Start!D7)","v":"Klára Trmotová"},{"$f":"IF(Start!E7=\"\",\"\",Start!E7)","v":"Dlažov"},{"$f":"IF(Start!F7=\"\",\"\",Start!F7)","v":"KT"},null,null,null,{"$f":"IF($D5=\"\",\"\",IF(OR($G5=\"DNF\",$H5=\"DNF\",$I5=\"DNF\",AND($G5=\"\",$H5=\"\",$I5=\"\")),\"DNF\",IF(OR($G5=\"NP\",$H5=\"NP\",$I5=\"NP\"),\"NP\",IF(ISERROR(MEDIAN($G5:$I5)),\"DNF\",IF(OR($G5=\"X\",$H5=\"X\",$I5=\"X\",$G5=\"\",$H5=\"\",$I5=\"\",$G5=\"x\",$H5=\"x\",$I5=\"x\"),MAX($G5:$I5),MEDIAN($G5:$I5))))))","v":"DNF"},null,null,null,null,{"$f":"IF($D5=\"\",\"\",IF(OR($L5=\"DNF\",$M5=\"DNF\",$N5=\"DNF\",AND($L5=\"\",$M5=\"\",$N5=\"\")),\"DNF\",IF(OR($L5=\"NP\",$M5=\"NP\",$N5=\"NP\"),\"NP\",IF(ISERROR(MEDIAN($L5:$N5)),\"DNF\",IF(OR($L5=\"X\",$M5=\"X\",$N5=\"X\",$L5=\"\",$M5=\"\",$N5=\"\",$L5=\"x\",$M5=\"x\",$N5=\"x\"),MAX($L5:$N5),MEDIAN($L5:$N5))))))","v":"DNF"},null,{"$f":"IF(D5=\"\",\"\",IF(OR(AND(J5=\"NP\",O5=\"NP\"),AND(J5=\"DNF\",O5=\"DNF\")),J5,IF(AND(J5=\"NP\",O5=\"DNF\"),J5,IF(AND(J5=\"DNF\",O5=\"NP\"),O5,MIN(J5,O5)))))","v":"DNF"},null,{"$f":"IF(D5=\"\",\"\",IF(OR(Q5=\"NP\",Q5=\"DNF\"),Q5,RANK(Q5,Q$5:Q$54,1)))","v":"DNF"},null,{"$f":"IF(D5=\"\",\"\",IF(Q5=\"NP\",MAX(S$5:S$54)+1,IF(Q5=\"DNF\",MAX(S$5:S$54)+COUNTIF(S$5:S$54,\"NP\")+1,RANK(Q5,Q$5:Q$54,1))))","v":1},null,{"$f":"IF($D5=\"\",9000,MAX(J5,O5)+(COUNTIF($J5:$J5,\"NP\")*600)+(COUNTIF($O5:$O5,\"NP\")*600)+(COUNTIF($J5:$J5,\"DNF\")*3600)+(COUNTIF($O5:$O5,\"DNF\")*3600))","v":7200}]
[null,2,{"$f":"IF(Start!C8=\"\",\"\",Start!C8)","v":2},{"$f":"IF(Start!D8=\"\",\"\",Start!D8)","v":"Tereza Grünerová "},{"$f":"IF(Start!E8=\"\",\"\",Start!E8)","v":"Brod nad Tichou"},{"$f":"IF(Start!F8=\"\",\"\",Start!F8)","v":"TA"},null,null,null,{"$f":"IF($D6=\"\",\"\",IF(OR($G6=\"DNF\",$H6=\"DNF\",$I6=\"DNF\",AND($G6=\"\",$H6=\"\",$I6=\"\")),\"DNF\",IF(OR($G6=\"NP\",$H6=\"NP\",$I6=\"NP\"),\"NP\",IF(ISERROR(MEDIAN($G6:$I6)),\"DNF\",IF(OR($G6=\"X\",$H6=\"X\",$I6=\"X\",$G6=\"\",$H6=\"\",$I6=\"\",$G6=\"x\",$H6=\"x\",$I6=\"x\"),MAX($G6:$I6),MEDIAN($G6:$I6))))))","v":"DNF"},null,null,null,null,{"$f":"IF($D6=\"\",\"\",IF(OR($L6=\"DNF\",$M6=\"DNF\",$N6=\"DNF\",AND($L6=\"\",$M6=\"\",$N6=\"\")),\"DNF\",IF(OR($L6=\"NP\",$M6=\"NP\",$N6=\"NP\"),\"NP\",IF(ISERROR(MEDIAN($L6:$N6)),\"DNF\",IF(OR($L6=\"X\",$M6=\"X\",$N6=\"X\",$L6=\"\",$M6=\"\",$N6=\"\",$L6=\"x\",$M6=\"x\",$N6=\"x\"),MAX($L6:$N6),MEDIAN($L6:$N6))))))","v":"DNF"},null,{"$f":"IF(D6=\"\",\"\",IF(OR(AND(J6=\"NP\",O6=\"NP\"),AND(J6=\"DNF\",O6=\"DNF\")),J6,IF(AND(J6=\"NP\",O6=\"DNF\"),J6,IF(AND(J6=\"DNF\",O6=\"NP\"),O6,MIN(J6,O6)))))","v":"DNF"},null,"DNF",null,1,null,{"$f":"IF($D6=\"\",9000,MAX(J6,O6)+(COUNTIF($J6:$J6,\"NP\")*600)+(COUNTIF($O6:$O6,\"NP\")*600)+(COUNTIF($J6:$J6,\"DNF\")*3600)+(COUNTIF($O6:$O6,\"DNF\")*3600))","v":7200}]
[null,3,{"$f":"IF(Start!C9=\"\",\"\",Start!C9)","v":3},{"$f":"IF(Start!D9=\"\",\"\",Start!D9)","v":"Iva Babková"},{"$f":"IF(Start!E9=\"\",\"\",Start!E9)","v":"Bystřice nad Úhlavou"},{"$f":"IF(Start!F9=\"\",\"\",Start!F9)","v":"KT"},null,null,null,"DNF",null,null,null,null,"DNF",null,"DNF",null,"DNF",null,1,null,7200]
[null,4,{"$f":"IF(Start!C10=\"\",\"\",Start!C10)","v":4},{"$f":"IF(Start!D10=\"\",\"\",Start!D10)","v":"Michaela Marešová"},{"$f":"IF(Start!E10=\"\",\"\",Start!E10)","v":"Planá"},{"$f":"IF(Start!F10=\"\",\"\",Start!F10)","v":"TA"},null,null,null,"DNF",null,null,null,null,"DNF",null,"DNF",null,"DNF",null,1,null,7200]
[null,5,{"$f":"IF(Start!C11=\"\",\"\",Start!C11)","v":5},{"$f":"IF(Start!D11=\"\",\"\",Start!D11)","v":"Adéla Stodolová"},{"$f":"IF(Start!E11=\"\",\"\",Start!E11)","v":"Planá"},{"$f":"IF(Start!F11=\"\",\"\",Start!F11)","v":"TA"},null,null,null,"DNF",null,null,null,null,"DNF",null,"DNF",null,"DNF",null,1,null,7200]
[null,6,{"$f":"IF(Start!C12=\"\",\"\",Start!C12)","v":6},{"$f":"IF(Start!D12=\"\",\"\",Start!D12)","v":""},{"$f":"IF(Start!E12=\"\",\"\",Start!E12)","v":""},{"$f":"IF(Start!F12=\"\",\"\",Start!F12)","v":""},null,null,null,"",null,null,null,null,"",null,"",null,"",null,"",null,9000]
[null,7,{"$f":"IF(Start!C13=\"\",\"\",Start!C13)","v":7},{"$f":"IF(Start!D13=\"\",\"\",Start!D13)","v":""},{"$f":"IF(Start!E13=\"\",\"\",Start!E13)","v":""},{"$f":"IF(Start!F13=\"\",\"\",Start!F13)","v":""},null,null,null,"",null,null,null,null,"",null,"",null,"",null,"",null,9000]
[null,8,{"$f":"IF(Start!C14=\"\",\"\",Start!C14)","v":8},{"$f":"IF(Start!D14=\"\",\"\",Start!D14)","v":""},{"$f":"IF(Start!E14=\"\",\"\",Start!E14)","v":""},{"$f":"IF(Start!F14=\"\",\"\",Start!F14)","v":""},null,null,null,"",null,null,null,null,"",null,"",null,"",null,"",null,9000]
[null,9,{"$f":"IF(Start!C15=\"\",\"\",Start!C15)","v":9},{"$f":"IF(Start!D15=\"\",\"\",Start!D15)","v":""},{"$f":"IF(Start!E15=\"\",\"\",Start!E15)","v":""},{"$f":"IF(Start!F15=\"\",\"\",Start!F15)","v":""},null,null,null,"",null,null,null,null,"",null,"",null,"",null,"",null,9000]
[null,10,{"$f":"IF(Start!C16=\"\",\"\",Start!C16)","v":10},{"$f":"IF(Start!D16=\"\",\"\",Start!D16)","v":""},{"$f":"IF(Start!E16=\"\",\"\",Start!E16)","v":""},{"$f":"IF(Start!F16=\"\",\"\",Start!F16)","v":""},null,null,null,"",null,null,null,null,"",null,"",null,"",null,"",null,9000]
[null,11,{"$f":"IF(Start!C17=\"\",\"\",Start!C17)","v":11},{"$f":"IF(Start!D17=\"\",\"\",Start!D17)","v":""},{"$f":"IF(Start!E17=\"\",\"\",Start!E17)","v":""},{"$f":"IF(Start!F17=\"\",\"\",Start!F17)","v":""},null,null,null,"",null,null,null,null,"",null,"",null,"",null,"",null,9000]
[null,12,{"$f":"IF(Start!C18=\"\",\"\",Start!C18)","v":12},{"$f":"IF(Start!D18=\"\",\"\",Start!D18)","v":""},{"$f":"IF(Start!E18=\"\",\"\",Start!E18)","v":""},{"$f":"IF(Start!F18=\"\",\"\",Start!F18)","v":""},null,null,null,"",null,null,null,null,"",null,"",null,"",null,"",null,9000]
[null,13,{"$f":"IF(Start!C19=\"\",\"\",Start!C19)","v":13},{"$f":"IF(Start!D19=\"\",\"\",Start!D19)","v":""},{"$f":"IF(Start!E19=\"\",\"\",Start!E19)","v":""},{"$f":"IF(Start!F19=\"\",\"\",Start!F19)","v":""},null,null,null,"",null,null,null,null,"",null,"",null,"",null,"",null,9000]
[null,14,{"$f":"IF(Start!C20=\"\",\"\",Start!C20)","v":14},{"$f":"IF(Start!D20=\"\",\"\",Start!D20)","v":""},{"$f":"IF(Start!E20=\"\",\"\",Start!E20)","v":""},{"$f":"IF(Start!F20=\"\",\"\",Start!F20)","v":""},null,null,null,"",null,null,null,null,"",null,"",null,"",null,"",null,9000]
[null,15,{"$f":"IF(Start!C21=\"\",\"\",Start!C21)","v":15},{"$f":"IF(Start!D21=\"\",\"\",Start!D21)","v":""},{"$f":"IF(Start!E21=\"\",\"\",Start!E21)","v":""},{"$f":"IF(Start!F21=\"\",\"\",Start!F21)","v":""},null,null,null,"",null,null,null,null,"",null,"",null,"",null,"",null,9000]
[null,16,{"$f":"IF(Start!C22=\"\",\"\",Start!C22)","v":16},{"$f":"IF(Start!D22=\"\",\"\",Start!D22)","v":""},{"$f":"IF(Start!E22=\"\",\"\",Start!E22)","v":""},{"$f":"IF(Start!F22=\"\",\"\",Start!F22)","v":""},null,null,null,"",null,null,null,null,"",null,"",null,"",null,"",null,9000]
[null,17,{"$f":"IF(Start!C23=\"\",\"\",Start!C23)","v":17},{"$f":"IF(Start!D23=\"\",\"\",Start!D23)","v":""},{"$f":"IF(Start!E23=\"\",\"\",Start!E23)","v":""},{"$f":"IF(Start!F23=\"\",\"\",Start!F23)","v":""},null,null,null,"",null,null,null,null,"",null,"",null,"",null,"",null,9000]
[null,18,{"$f":"IF(Start!C24=\"\",\"\",Start!C24)","v":18},{"$f":"IF(Start!D24=\"\",\"\",Start!D24)","v":""},{"$f":"IF(Start!E24=\"\",\"\",Start!E24)","v":""},{"$f":"IF(Start!F24=\"\",\"\",Start!F24)","v":""},null,null,null,"",null,null,null,null,"",null,"",null,"",null,"",null,9000]
[null,19,{"$f":"IF(Start!C25=\"\",\"\",Start!C25)","v":19},{"$f":"IF(Start!D25=\"\",\"\",Start!D25)","v":""},{"$f":"IF(Start!E25=\"\",\"\",Start!E25)","v":""},{"$f":"IF(Start!F25=\"\",\"\",Start!F25)","v":""},null,null,null,"",null,null,null,null,"",null,"",null,"",null,"",null,9000]
[null,20,{"$f":"IF(Start!C26=\"\",\"\",Start!C26)","v":20},{"$f":"IF(Start!D26=\"\",\"\",Start!D26)","v":""},{"$f":"IF(Start!E26=\"\",\"\",Start!E26)","v":""},{"$f":"IF(Start!F26=\"\",\"\",Start!F26)","v":""},null,null,null,"",null,null,null,null,"",null,"",null,"",null,"",null,9000]
[null,21,{"$f":"IF(Start!C27=\"\",\"\",Start!C27)","v":21},{"$f":"IF(Start!D27=\"\",\"\",Start!D27)","v":""},{"$f":"IF(Start!E27=\"\",\"\",Start!E27)","v":""},{"$f":"IF(Start!F27=\"\",\"\",Start!F27)","v":""},null,null,null,"",null,null,null,null,"",null,"",null,"",null,"",null,9000]
[null,22,{"$f":"IF(Start!C28=\"\",\"\",Start!C28)","v":22},{"$f":"IF(Start!D28=\"\",\"\",Start!D28)","v":""},{"$f":"IF(Start!E28=\"\",\"\",Start!E28)","v":""},{"$f":"IF(Start!F28=\"\",\"\",Start!F28)","v":""},null,null,null,"",null,null,null,null,"",null,"",null,"",null,"",null,9000]
[null,3,{"$f":"IF(Start!C29=\"\",\"\",Start!C29)","v":23},{"$f":"IF(Start!D29=\"\",\"\",Start!D29)","v":""},{"$f":"IF(Start!E29=\"\",\"\",Start!E29)","v":""},{"$f":"IF(Start!F29=\"\",\"\",Start!F29)","v":""},null,null,null,"",null,null,null,null,"",null,"",null,"",null,"",null,9000]
[null,4,{"$f":"IF(Start!C30=\"\",\"\",Start!C30)","v":24},{"$f":"IF(Start!D30=\"\",\"\",Start!D30)","v":""},{"$f":"IF(Start!E30=\"\",\"\",Start!E30)","v":""},{"$f":"IF(Start!F30=\"\",\"\",Start!F30)","v":""},null,null,null,"",null,null,null,null,"",null,"",null,"",null,"",null,9000]
[null,5,{"$f":"IF(Start!C31=\"\",\"\",Start!C31)","v":25},{"$f":"IF(Start!D31=\"\",\"\",Start!D31)","v":""},{"$f":"IF(Start!E31=\"\",\"\",Start!E31)","v":""},{"$f":"IF(Start!F31=\"\",\"\",Start!F31)","v":""},null,null,null,"",null,null,null,null,"",null,"",null,"",null,"",null,9000]
[null,6,{"$f":"IF(Start!C32=\"\",\"\",Start!C32)","v":26},{"$f":"IF(Start!D32=\"\",\"\",Start!D32)","v":""},{"$f":"IF(Start!E32=\"\",\"\",Start!E32)","v":""},{"$f":"IF(Start!F32=\"\",\"\",Start!F32)","v":""},null,null,null,"",null,null,null,null,"",null,"",null,"",null,"",null,9000]
[null,7,{"$f":"IF(Start!C33=\"\",\"\",Start!C33)","v":27},{"$f":"IF(Start!D33=\"\",\"\",Start!D33)","v":""},{"$f":"IF(Start!E33=\"\",\"\",Start!E33)","v":""},{"$f":"IF(Start!F33=\"\",\"\",Start!F33)","v":""},null,null,null,"",null,null,null,null,"",null,"",null,"",null,"",null,9000]
[null,8,{"$f":"IF(Start!C34=\"\",\"\",Start!C34)","v":28},{"$f":"IF(Start!D34=\"\",\"\",Start!D34)","v":""},{"$f":"IF(Start!E34=\"\",\"\",Start!E34)","v":""},{"$f":"IF(Start!F34=\"\",\"\",Start!F34)","v":""},null,null,null,"",null,null,null,null,"",null,"",null,"",null,"",null,9000]
[null,9,{"$f":"IF(Start!C35=\"\",\"\",Start!C35)","v":29},{"$f":"IF(Start!D35=\"\",\"\",Start!D35)","v":""},{"$f":"IF(Start!E35=\"\",\"\",Start!E35)","v":""},{"$f":"IF(Start!F35=\"\",\"\",Start!F35)","v":""},null,null,null,"",null,null,null,null,"",null,"",null,"",null,"",null,9000]
[null,10,{"$f":"IF(Start!C36=\"\",\"\",Start!C36)","v":30},{"$f":"IF(Start!D36=\"\",\"\",Start!D36)","v":""},{"$f":"IF(Start!E36=\"\",\"\",Start!E36)","v":""},{"$f":"IF(Start!F36=\"\",\"\",Start!F36)","v":""},null,null,null,"",null,null,null,null,"",null,"",null,"",null,"",null,9000]
[null,11,{"$f":"IF(Start!C37=\"\",\"\",Start!C37)","v":31},{"$f":"IF(Start!D37=\"\",\"\",Start!D37)","v":""},{"$f":"IF(Start!E37=\"\",\"\",Start!E37)","v":""},{"$f":"IF(Start!F37=\"\",\"\",Start!F37)","v":""},null,null,null,"",null,null,null,null,"",null,"",null,"",null,"",null,9000]
[null,12,{"$f":"IF(Start!C38=\"\",\"\",Start!C38)","v":32},{"$f":"IF(Start!D38=\"\",\"\",Start!D38)","v":""},{"$f":"IF(Start!E38=\"\",\"\",Start!E38)","v":""},{"$f":"IF(Start!F38=\"\",\"\",Start!F38)","v":""},null,null,null,"",null,null,null,null,"",null,"",null,"",null,"",null,9000]
[null,13,{"$f":"IF(Start!C39=\"\",\"\",Start!C39)","v":33},{"$f":"IF(Start!D39=\"\",\"\",Start!D39)","v":""},{"$f":"IF(Start!E39=\"\",\"\",Start!E39)","v":""},{"$f":"IF(Start!F39=\"\",\"\",Start!F39)","v":""},null,null,null,"",null,null,null,null,"",null,"",null,"",null,"",null,9000]
[null,14,{"$f":"IF(Start!C40=\"\",\"\",Start!C40)","v":34},{"$f":"IF(Start!D40=\"\",\"\",Start!D40)","v":""},{"$f":"IF(Start!E40=\"\",\"\",Start!E40)","v":""},{"$f":"IF(Start!F40=\"\",\"\",Start!F40)","v":""},null,null,null,"",null,null,null,null,"",null,"",null,"",null,"",null,9000]
[null,15,{"$f":"IF(Start!C41=\"\",\"\",Start!C41)","v":35},{"$f":"IF(Start!D41=\"\",\"\",Start!D41)","v":""},{"$f":"IF(Start!E41=\"\",\"\",Start!E41)","v":""},{"$f":"IF(Start!F41=\"\",\"\",Start!F41)","v":""},null,null,null,"",null,null,null,null,"",null,"",null,"",null,"",null,9000]
[null,16,{"$f":"IF(Start!C42=\"\",\"\",Start!C42)","v":36},{"$f":"IF(Start!D42=\"\",\"\",Start!D42)","v":""},{"$f":"IF(Start!E42=\"\",\"\",Start!E42)","v":""},{"$f":"IF(Start!F42=\"\",\"\",Start!F42)","v":""},null,null,null,"",null,null,null,null,"",null,"",null,"",null,"",null,9000]
[null,17,{"$f":"IF(Start!C43=\"\",\"\",Start!C43)","v":37},{"$f":"IF(Start!D43=\"\",\"\",Start!D43)","v":""},{"$f":"IF(Start!E43=\"\",\"\",Start!E43)","v":""},{"$f":"IF(Start!F43=\"\",\"\",Start!F43)","v":""},null,null,null,"",null,null,null,null,"",null,"",null,"",null,"",null,9000]
[null,18,{"$f":"IF(Start!C44=\"\",\"\",Start!C44)","v":38},{"$f":"IF(Start!D44=\"\",\"\",Start!D44)","v":""},{"$f":"IF(Start!E44=\"\",\"\",Start!E44)","v":""},{"$f":"IF(Start!F44=\"\",\"\",Start!F44)","v":""},null,null,null,"",null,null,null,null,"",null,"",null,"",null,"",null,9000]
[null,19,{"$f":"IF(Start!C45=\"\",\"\",Start!C45)","v":39},{"$f":"IF(Start!D45=\"\",\"\",Start!D45)","v":""},{"$f":"IF(Start!E45=\"\",\"\",Start!E45)","v":""},{"$f":"IF(Start!F45=\"\",\"\",Start!F45)","v":""},null,null,null,"",null,null,null,null,"",null,"",null,"",null,"",null,9000]
[null,20,{"$f":"IF(Start!C46=\"\",\"\",Start!C46)","v":40},{"$f":"IF(Start!D46=\"\",\"\",Start!D46)","v":""},{"$f":"IF(Start!E46=\"\",\"\",Start!E46)","v":""},{"$f":"IF(Start!F46=\"\",\"\",Start!F46)","v":""},null,null,null,"",null,null,null,null,"",null,"",null,"",null,"",null,9000]
[null,21,{"$f":"IF(Start!C47=\"\",\"\",Start!C47)","v":41},{"$f":"IF(Start!D47=\"\",\"\",Start!D47)","v":""},{"$f":"IF(Start!E47=\"\",\"\",Start!E47)","v":""},{"$f":"IF(Start!F47=\"\",\"\",Start!F47)","v":""},null,null,null,"",null,null,null,null,"",null,"",null,"",null,"",null,9000]
[null,16,{"$f":"IF(Start!C48=\"\",\"\",Start!C48)","v":42},{"$f":"IF(Start!D48=\"\",\"\",Start!D48)","v":""},{"$f":"IF(Start!E48=\"\",\"\",Start!E48)","v":""},{"$f":"IF(Start!F48=\"\",\"\",Start!F48)","v":""},null,null,null,"",null,null,null,null,"",null,"",null,{"$f":"IF(D46=\"\",\"\",IF(OR(Q46=\"NP\",Q46=\"DNF\"),Q46,RANK(Q46,Q$5:Q$54,1)))","v":""},null,{"$f":"IF(D46=\"\",\"\",IF(Q46=\"NP\",MAX(S$5:S$54)+1,IF(Q46=\"DNF\",MAX(S$5:S$54)+COUNTIF(S$5:S$54,\"NP\")+1,RANK(Q46,Q$5:Q$54,1))))","v":""},null,{"$f":"IF($D46=\"\",9000,MAX(J46,O46)+(COUNTIF($J46:$J46,\"NP\")*600)+(COUNTIF($O46:$O46,\"NP\")*600)+(COUNTIF($J46:$J46,\"DNF\")*3600)+(COUNTIF($O46:$O46,\"DNF\")*3600))","v":9000}]
[null,17,{"$f":"IF(Start!C49=\"\",\"\",Start!C49)","v":43},{"$f":"IF(Start!D49=\"\",\"\",Start!D49)","v":""},{"$f":"IF(Start!E49=\"\",\"\",Start!E49)","v":""},{"$f":"IF(Start!F49=\"\",\"\",Start!F49)","v":""},null,null,null,"",null,null,null,null,"",null,"",null,{"$f":"IF(D47=\"\",\"\",IF(OR(Q47=\"NP\",Q47=\"DNF\"),Q47,RANK(Q47,Q$5:Q$54,1)))","v":""},null,{"$f":"IF(D47=\"\",\"\",IF(Q47=\"NP\",MAX(S$5:S$54)+1,IF(Q47=\"DNF\",MAX(S$5:S$54)+COUNTIF(S$5:S$54,\"NP\")+1,RANK(Q47,Q$5:Q$54,1))))","v":""},null,{"$f":"IF($D47=\"\",9000,MAX(J47,O47)+(COUNTIF($J47:$J47,\"NP\")*600)+(COUNTIF($O47:$O47,\"NP\")*600)+(COUNTIF($J47:$J47,\"DNF\")*3600)+(COUNTIF($O47:$O47,\"DNF\")*3600))","v":9000}]
[null,18,{"$f":"IF(Start!C50=\"\",\"\",Start!C50)","v":44},{"$f":"IF(Start!D50=\"\",\"\",Start!D50)","v":""},{"$f":"IF(Start!E50=\"\",\"\",Start!E50)","v":""},{"$f":"IF(Start!F50=\"\",\"\",Start!F50)","v":""},null,null,null,"",null,null,null,null,"",null,"",null,{"$f":"IF(D48=\"\",\"\",IF(OR(Q48=\"NP\",Q48=\"DNF\"),Q48,RANK(Q48,Q$5:Q$54,1)))","v":""},null,{"$f":"IF(D48=\"\",\"\",IF(Q48=\"NP\",MAX(S$5:S$54)+1,IF(Q48=\"DNF\",MAX(S$5:S$54)+COUNTIF(S$5:S$54,\"NP\")+1,RANK(Q48,Q$5:Q$54,1))))","v":""},null,{"$f":"IF($D48=\"\",9000,MAX(J48,O48)+(COUNTIF($J48:$J48,\"NP\")*600)+(COUNTIF($O48:$O48,\"NP\")*600)+(COUNTIF($J48:$J48,\"DNF\")*3600)+(COUNTIF($O48:$O48,\"DNF\")*3600))","v":9000}]
[null,19,{"$f":"IF(Start!C51=\"\",\"\",Start!C51)","v":45},{"$f":"IF(Start!D51=\"\",\"\",Start!D51)","v":""},{"$f":"IF(Start!E51=\"\",\"\",Start!E51)","v":""},{"$f":"IF(Start!F51=\"\",\"\",Start!F51)","v":""},null,null,null,"",null,null,null,null,"",null,"",null,{"$f":"IF(D49=\"\",\"\",IF(OR(Q49=\"NP\",Q49=\"DNF\"),Q49,RANK(Q49,Q$5:Q$54,1)))","v":""},null,{"$f":"IF(D49=\"\",\"\",IF(Q49=\"NP\",MAX(S$5:S$54)+1,IF(Q49=\"DNF\",MAX(S$5:S$54)+COUNTIF(S$5:S$54,\"NP\")+1,RANK(Q49,Q$5:Q$54,1))))","v":""},null,{"$f":"IF($D49=\"\",9000,MAX(J49,O49)+(COUNTIF($J49:$J49,\"NP\")*600)+(COUNTIF($O49:$O49,\"NP\")*600)+(COUNTIF($J49:$J49,\"DNF\")*3600)+(COUNTIF($O49:$O49,\"DNF\")*3600))","v":9000}]
[null,20,{"$f":"IF(Start!C52=\"\",\"\",Start!C52)","v":46},{"$f":"IF(Start!D52=\"\",\"\",Start!D52)","v":""},{"$f":"IF(Start!E52=\"\",\"\",Start!E52)","v":""},{"$f":"IF(Start!F52=\"\",\"\",Start!F52)","v":""},null,null,null,"",null,null,null,null,"",null,"",null,{"$f":"IF(D50=\"\",\"\",IF(OR(Q50=\"NP\",Q50=\"DNF\"),Q50,RANK(Q50,Q$5:Q$54,1)))","v":""},null,{"$f":"IF(D50=\"\",\"\",IF(Q50=\"NP\",MAX(S$5:S$54)+1,IF(Q50=\"DNF\",MAX(S$5:S$54)+COUNTIF(S$5:S$54,\"NP\")+1,RANK(Q50,Q$5:Q$54,1))))","v":""},null,{"$f":"IF($D50=\"\",9000,MAX(J50,O50)+(COUNTIF($J50:$J50,\"NP\")*600)+(COUNTIF($O50:$O50,\"NP\")*600)+(COUNTIF($J50:$J50,\"DNF\")*3600)+(COUNTIF($O50:$O50,\"DNF\")*3600))","v":9000}]
[null,22,{"$f":"IF(Start!C53=\"\",\"\",Start!C53)","v":47},{"$f":"IF(Start!D53=\"\",\"\",Start!D53)","v":""},{"$f":"IF(Start!E53=\"\",\"\",Start!E53)","v":""},{"$f":"IF(Start!F53=\"\",\"\",Start!F53)","v":""},null,null,null,"",null,null,null,null,"",null,"",null,"",null,"",null,9000]
[null,23,{"$f":"IF(Start!C54=\"\",\"\",Start!C54)","v":48},{"$f":"IF(Start!D54=\"\",\"\",Start!D54)","v":""},{"$f":"IF(Start!E54=\"\",\"\",Start!E54)","v":""},{"$f":"IF(Start!F54=\"\",\"\",Start!F54)","v":""},null,null,null,"",null,null,null,null,"",null,"",null,"",null,"",null,9000]
[null,24,{"$f":"IF(Start!C55=\"\",\"\",Start!C55)","v":49},{"$f":"IF(Start!D55=\"\",\"\",Start!D55)","v":""},{"$f":"IF(Start!E55=\"\",\"\",Start!E55)","v":""},{"$f":"IF(Start!F55=\"\",\"\",Start!F55)","v":""},null,null,null,"",null,null,null,null,"",null,"",null,"",null,"",null,9000]
[null,25,{"$f":"IF(Start!C56=\"\",\"\",Start!C56)","v":50},{"$f":"IF(Start!D56=\"\",\"\",Start!D56)","v":""},{"$f":"IF(Start!E56=\"\",\"\",Start!E56)","v":""},{"$f":"IF(Start!F56=\"\",\"\",Start!F56)","v":""},null,null,null,"",null,null,null,null,"",null,"",null,"",null,"",null,9000]

{"sheet":"DV - P","index":11,"n_rows":50,"n_cols":26,"rows_kept":50,"cut":false,"hidden":false,"merged":[]}
[null,1,"","","",null,null,null,"",null,null,null,null,"",null,"",null,"",null,"",null,9000,1,null,"",1]
[null,2,"","","",null,null,null,"",null,null,null,null,"",null,"",null,"",null,"",null,9000,1,null,"",1]
[null,3,"","","",null,null,null,"",null,null,null,null,"",null,"",null,"",null,"",null,9000,1,null,"",1]
[null,4,"","","",null,null,null,"",null,null,null,null,"",null,"",null,"",null,"",null,9000,1,null,"",1]
[null,5,"","","",null,null,null,"",null,null,null,null,"",null,"",null,"",null,"",null,9000,1,null,"",1]
[null,6,"","","",null,null,null,"",null,null,null,null,"",null,"",null,"",null,"",null,9000,1,null,"",1]
[null,7,"","","",null,null,null,"",null,null,null,null,"",null,"",null,"",null,"",null,9000,1,null,"",1]
[null,8,"","","",null,null,null,"",null,null,null,null,"",null,"",null,"",null,"",null,9000,1,null,"",1]
[null,9,"","","",null,null,null,"",null,null,null,null,"",null,"",null,"",null,"",null,9000,1,null,"",1]
[null,10,"","","",null,null,null,"",null,null,null,null,"",null,"",null,"",null,"",null,9000,1,null,"",1]
[null,11,"","","",null,null,null,"",null,null,null,null,"",null,"",null,"",null,"",null,9000,1,null,"",1]
[null,12,"","","",null,null,null,"",null,null,null,null,"",null,"",null,"",null,"",null,9000,1,null,"",1]
[null,13,"","","",null,null,null,"",null,null,null,null,"",null,"",null,"",null,"",null,9000,1,null,"",1]
[null,14,"","","",null,null,null,"",null,null,null,null,"",null,"",null,"",null,"",null,9000,1,null,"",1]
[null,15,"","","",null,null,null,"",null,null,null,null,"",null,"",null,"",null,"",null,9000,1,null,"",1]
[null,16,"","","",null,null,null,"",null,null,null,null,"",null,"",null,"",null,"",null,9000,1,null,"",1]
[null,17,"","","",null,null,null,"",null,null,null,null,"",null,"",null,"",null,"",null,9000,1,null,"",1]
[null,18,"","","",null,null,null,"",null,null,null,null,"",null,"",null,"",null,"",null,9000,1,null,"",1]
[null,19,"","","",null,null,null,"",null,null,null,null,"",null,"",null,"",null,"",null,9000,1,null,"",1]
[null,20,"","","",null,null,null,"",null,null,null,null,"",null,"",null,"",null,"",null,9000,1,null,"",1]
[null,21,"","","",null,null,null,"",null,null,null,null,"",null,"",null,"",null,"",null,9000,1,null,"",1]
[null,22,"","","",null,null,null,"",null,null,null,null,"",null,"",null,"",null,"",null,9000,1,null,"",1]
[null,23,"","","",null,null,null,"",null,null,null,null,"",null,"",null,"",null,"",null,9000,1,null,"",1]
[null,24,"","","",null,null,null,"",null,null,null,null,"",null,"",null,"",null,"",null,9000,1,null,"",1]
[null,25,"","","",null,null,null,"",null,null,null,null,"",null,"",null,"",null,"",null,9000,1,null,"",1]
[null,26,"","","",null,null,null,"",null,null,null,null,"",null,"",null,"",null,"",null,9000,1,null,"",1]
[null,27,"","","",null,null,null,"",null,null,null,null,"",null,"",null,"",null,"",null,9000,1,null,"",1]
[null,28,"","","",null,null,null,"",null,null,null,null,"",null,"",null,"",null,"",null,9000,1,null,"",1]
[null,29,"","","",null,null,null,"",null,null,null,null,"",null,"",null,"",null,"",null,9000,1,null,"",1]
[null,30,"","","",null,null,null,"",null,null,null,null,"",null,"",null,"",null,"",null,9000,1,null,"",1]
[null,31,"","","",null,null,null,"",null,null,null,null,"",null,"",null,"",null,"",null,9000,1,null,"",1]
[null,32,"","","",null,null,null,"",null,null,null,null,"",null,"",null,"",null,"",null,9000,1,null,"",1]
[null,33,"","","",null,null,null,"",null,null,null,null,"",null,"",null,"",null,"",null,9000,1,null,"",1]
[null,34,"","","",null,null,null,"",null,null,null,null,"",null,"",null,"",null,"",null,9000,1,null,"",1]
[null,35,"","","",null,null,null,"",null,null,null,null,"",null,"",null,"",null,"",null,9000,1,null,"",1]
[null,36,"","","",null,null,null,"",null,null,null,null,"",null,"",null,"",null,"",null,9000,1,null,"",1]
[null,37,"","","",null,null,null,"",null,null,null,null,"",null,"",null,"",null,"",null,9000,1,null,"",1]
[null,38,"","","",null,null,null,"",null,null,null,null,"",null,"",null,"",null,"",null,9000,1,null,"",1]
[null,39,"","","",null,null,null,"",null,null,null,null,"",null,"",null,"",null,"",null,9000,1,null,"",1]
[null,40,"","","",null,null,null,"",null,null,null,null,"",null,"",null,"",null,"",null,9000,1,null,"",1]
[null,41,"","","",null,null,null,"",null,null,null,null,"",null,"",null,"",null,"",null,9000,1,null,"",1]
[null,42,"","","",null,null,null,"",null,null,null,null,"",null,"",null,"",null,"",null,9000,1,null,"",1]
[null,43,"","","",null,null,null,"",null,null,null,null,"",null,"",null,"",null,"",null,9000,1,null,"",1]
[null,44,"","","",null,null,null,"",null,null,null,null,"",null,"",null,"",null,"",null,9000,1,null,"",1]
[null,45,"","","",null,null,null,"",null,null,null,null,"",null,"",null,"",null,"",null,9000,1,null,"",1]
[null,46,"","","",null,null,null,"",null,null,null,null,"",null,"",null,"",null,"",null,9000,1,null,"",1]
[null,47,"","","",null,null,null,"",null,null,null,null,"",null,"",null,"",null,"",null,9000,1,null,"",1]
[null,48,"","","",null,null,null,"",null,null,null,null,"",null,"",null,"",null,"",null,9000,1,null,"",1]
[null,49,"","","",null,null,null,"",null,null,null,null,"",null,"",null,"",null,"",null,9000,1,null,"",1]
[null,50,"","","",null,null,null,"",null,null,null,null,"",null,"",null,"",null,"",null,9000,1,null,"",1]

{"sheet":"DV-P","index":12,"n_rows":57,"n_cols":10,"rows_kept":57,"cut":false,"hidden":false,"merged":[[5,4,6,4],[5,5,6,5],[0,1,0,9],[2,1,2,3],[2,4,2,9],[4,1,4,2],[5,6,6,6],[5,7,6,7],[5,9,6,9],[5,1,6,1],[5,2,6,2],[5,3,6,3]]}
[null,"DVOJBOJ - Pořadí"]
[]
[null,{"$f":"Start!$B$2","v":"Krajské kolo soutěží dorostu"},null,null,{"$f":"Start!$B$3","v":"19. června 2021 Tachov"}]
[]
[null,{"$f":"Start!$D$5","v":"Dorky - Střední"}]
[null,"Pořadí","Start. číslo","Jméno","SDH",{"$f":"Start!$F$6","v":"Okres"},"čas             I. pokusu","čas            II. pokusu",null,"Výsledný čas"]
[]
[null,{"$f":"IF('DV - P'!C1=\"\",\"\",'DV - P'!W1)","v":""},{"$f":"IF('DV - P'!C1=\"\",\"\",'DV - P'!B1)","v":""},{"$f":"IF('DV - P'!C1=\"\",\"\",'DV - P'!C1)","v":""},{"$f":"IF('DV - P'!D1=\"\",\"\",'DV - P'!D1)","v":""},{"$f":"IF('DV - P'!E1=\"\",\"\",'DV - P'!E1)","v":""},{"$f":"IF('DV - P'!I1=\"\",\"\",'DV - P'!I1)","v":""},{"$f":"IF('DV - P'!N1=\"\",\"\",'DV - P'!N1)","v":""},null,{"$f":"IF('DV - P'!P1=\"\",\"\",'DV - P'!P1)","v":""}]
[null,{"$f":"IF('DV - P'!C2=\"\",\"\",'DV - P'!W2)","v":""},{"$f":"IF('DV - P'!C2=\"\",\"\",'DV - P'!B2)","v":""},{"$f":"IF('DV - P'!C2=\"\",\"\",'DV - P'!C2)","v":""},{"$f":"IF('DV - P'!D2=\"\",\"\",'DV - P'!D2)","v":""},{"$f":"IF('DV - P'!E2=\"\",\"\",'DV - P'!E2)","v":""},{"$f":"IF('DV - P'!I2=\"\",\"\",'DV - P'!I2)","v":""},{"$f":"IF('DV - P'!N2=\"\",\"\",'DV - P'!N2)","v":""},null,{"$f":"IF('DV - P'!P2=\"\",\"\",'DV - P'!P2)","v":""}]
[null,{"$f":"IF('DV - P'!C3=\"\",\"\",'DV - P'!W3)","v":""},{"$f":"IF('DV - P'!C3=\"\",\"\",'DV - P'!B3)","v":""},{"$f":"IF('DV - P'!C3=\"\",\"\",'DV - P'!C3)","v":""},{"$f":"IF('DV - P'!D3=\"\",\"\",'DV - P'!D3)","v":""},{"$f":"IF('DV - P'!E3=\"\",\"\",'DV - P'!E3)","v":""},{"$f":"IF('DV - P'!I3=\"\",\"\",'DV - P'!I3)","v":""},{"$f":"IF('DV - P'!N3=\"\",\"\",'DV - P'!N3)","v":""},null,{"$f":"IF('DV - P'!P3=\"\",\"\",'DV - P'!P3)","v":""}]
[null,{"$f":"IF('DV - P'!C4=\"\",\"\",'DV - P'!W4)","v":""},{"$f":"IF('DV - P'!C4=\"\",\"\",'DV - P'!B4)","v":""},{"$f":"IF('DV - P'!C4=\"\",\"\",'DV - P'!C4)","v":""},{"$f":"IF('DV - P'!D4=\"\",\"\",'DV - P'!D4)","v":""},{"$f":"IF('DV - P'!E4=\"\",\"\",'DV - P'!E4)","v":""},{"$f":"IF('DV - P'!I4=\"\",\"\",'DV - P'!I4)","v":""},{"$f":"IF('DV - P'!N4=\"\",\"\",'DV - P'!N4)","v":""},null,{"$f":"IF('DV - P'!P4=\"\",\"\",'DV - P'!P4)","v":""}]
[null,{"$f":"IF('DV - P'!C5=\"\",\"\",'DV - P'!W5)","v":""},{"$f":"IF('DV - P'!C5=\"\",\"\",'DV - P'!B5)","v":""},{"$f":"IF('DV - P'!C5=\"\",\"\",'DV - P'!C5)","v":""},{"$f":"IF('DV - P'!D5=\"\",\"\",'DV - P'!D5)","v":""},{"$f":"IF('DV - P'!E5=\"\",\"\",'DV - P'!E5)","v":""},{"$f":"IF('DV - P'!I5=\"\",\"\",'DV - P'!I5)","v":""},{"$f":"IF('DV - P'!N5=\"\",\"\",'DV - P'!N5)","v":""},null,{"$f":"IF('DV - P'!P5=\"\",\"\",'DV - P'!P5)","v":""}]
[null,{"$f":"IF('DV - P'!C6=\"\",\"\",'DV - P'!W6)","v":""},{"$f":"IF('DV - P'!C6=\"\",\"\",'DV - P'!B6)","v":""},{"$f":"IF('DV - P'!C6=\"\",\"\",'DV - P'!C6)","v":""},{"$f":"IF('DV - P'!D6=\"\",\"\",'DV - P'!D6)","v":""},{"$f":"IF('DV - P'!E6=\"\",\"\",'DV - P'!E6)","v":""},{"$f":"IF('DV - P'!I6=\"\",\"\",'DV - P'!I6)","v":""},{"$f":"IF('DV - P'!N6=\"\",\"\",'DV - P'!N6)","v":""},null,{"$f":"IF('DV - P'!P6=\"\",\"\",'DV - P'!P6)","v":""}]
[null,{"$f":"IF('DV - P'!C7=\"\",\"\",'DV - P'!W7)","v":""},{"$f":"IF('DV - P'!C7=\"\",\"\",'DV - P'!B7)","v":""},{"$f":"IF('DV - P'!C7=\"\",\"\",'DV - P'!C7)","v":""},{"$f":"IF('DV - P'!D7=\"\",\"\",'DV - P'!D7)","v":""},{"$f":"IF('DV - P'!E7=\"\",\"\",'DV - P'!E7)","v":""},{"$f":"IF('DV - P'!I7=\"\",\"\",'DV - P'!I7)","v":""},{"$f":"IF('DV - P'!N7=\"\",\"\",'DV - P'!N7)","v":""},null,{"$f":"IF('DV - P'!P7=\"\",\"\",'DV - P'!P7)","v":""}]
[null,{"$f":"IF('DV - P'!C8=\"\",\"\",'DV - P'!W8)","v":""},{"$f":"IF('DV - P'!C8=\"\",\"\",'DV - P'!B8)","v":""},{"$f":"IF('DV - P'!C8=\"\",\"\",'DV - P'!C8)","v":""},{"$f":"IF('DV - P'!D8=\"\",\"\",'DV - P'!D8)","v":""},{"$f":"IF('DV - P'!E8=\"\",\"\",'DV - P'!E8)","v":""},{"$f":"IF('DV - P'!I8=\"\",\"\",'DV - P'!I8)","v":""},{"$f":"IF('DV - P'!N8=\"\",\"\",'DV - P'!N8)","v":""},null,{"$f":"IF('DV - P'!P8=\"\",\"\",'DV - P'!P8)","v":""}]
[null,{"$f":"IF('DV - P'!C9=\"\",\"\",'DV - P'!W9)","v":""},{"$f":"IF('DV - P'!C9=\"\",\"\",'DV - P'!B9)","v":""},{"$f":"IF('DV - P'!C9=\"\",\"\",'DV - P'!C9)","v":""},{"$f":"IF('DV - P'!D9=\"\",\"\",'DV - P'!D9)","v":""},{"$f":"IF('DV - P'!E9=\"\",\"\",'DV - P'!E9)","v":""},{"$f":"IF('DV - P'!I9=\"\",\"\",'DV - P'!I9)","v":""},{"$f":"IF('DV - P'!N9=\"\",\"\",'DV - P'!N9)","v":""},null,{"$f":"IF('DV - P'!P9=\"\",\"\",'DV - P'!P9)","v":""}]
[null,{"$f":"IF('DV - P'!C10=\"\",\"\",'DV - P'!W10)","v":""},{"$f":"IF('DV - P'!C10=\"\",\"\",'DV - P'!B10)","v":""},{"$f":"IF('DV - P'!C10=\"\",\"\",'DV - P'!C10)","v":""},{"$f":"IF('DV - P'!D10=\"\",\"\",'DV - P'!D10)","v":""},{"$f":"IF('DV - P'!E10=\"\",\"\",'DV - P'!E10)","v":""},{"$f":"IF('DV - P'!I10=\"\",\"\",'DV - P'!I10)","v":""},{"$f":"IF('DV - P'!N10=\"\",\"\",'DV - P'!N10)","v":""},null,{"$f":"IF('DV - P'!P10=\"\",\"\",'DV - P'!P10)","v":""}]
[null,{"$f":"IF('DV - P'!C11=\"\",\"\",'DV - P'!W11)","v":""},{"$f":"IF('DV - P'!C11=\"\",\"\",'DV - P'!B11)","v":""},{"$f":"IF('DV - P'!C11=\"\",\"\",'DV - P'!C11)","v":""},{"$f":"IF('DV - P'!D11=\"\",\"\",'DV - P'!D11)","v":""},{"$f":"IF('DV - P'!E11=\"\",\"\",'DV - P'!E11)","v":""},{"$f":"IF('DV - P'!I11=\"\",\"\",'DV - P'!I11)","v":""},{"$f":"IF('DV - P'!N11=\"\",\"\",'DV - P'!N11)","v":""},null,{"$f":"IF('DV - P'!P11=\"\",\"\",'DV - P'!P11)","v":""}]
[null,{"$f":"IF('DV - P'!C12=\"\",\"\",'DV - P'!W12)","v":""},{"$f":"IF('DV - P'!C12=\"\",\"\",'DV - P'!B12)","v":""},{"$f":"IF('DV - P'!C12=\"\",\"\",'DV - P'!C12)","v":""},{"$f":"IF('DV - P'!D12=\"\",\"\",'DV - P'!D12)","v":""},{"$f":"IF('DV - P'!E12=\"\",\"\",'DV - P'!E12)","v":""},{"$f":"IF('DV - P'!I12=\"\",\"\",'DV - P'!I12)","v":""},{"$f":"IF('DV - P'!N12=\"\",\"\",'DV - P'!N12)","v":""},null,{"$f":"IF('DV - P'!P12=\"\",\"\",'DV - P'!P12)","v":""}]
[null,{"$f":"IF('DV - P'!C13=\"\",\"\",'DV - P'!W13)","v":""},{"$f":"IF('DV - P'!C13=\"\",\"\",'DV - P'!B13)","v":""},{"$f":"IF('DV - P'!C13=\"\",\"\",'DV - P'!C13)","v":""},{"$f":"IF('DV - P'!D13=\"\",\"\",'DV - P'!D13)","v":""},{"$f":"IF('DV - P'!E13=\"\",\"\",'DV - P'!E13)","v":""},{"$f":"IF('DV - P'!I13=\"\",\"\",'DV - P'!I13)","v":""},{"$f":"IF('DV - P'!N13=\"\",\"\",'DV - P'!N13)","v":""},null,{"$f":"IF('DV - P'!P13=\"\",\"\",'DV - P'!P13)","v":""}]
[null,{"$f":"IF('DV - P'!C14=\"\",\"\",'DV - P'!W14)","v":""},{"$f":"IF('DV - P'!C14=\"\",\"\",'DV - P'!B14)","v":""},{"$f":"IF('DV - P'!C14=\"\",\"\",'DV - P'!C14)","v":""},{"$f":"IF('DV - P'!D14=\"\",\"\",'DV - P'!D14)","v":""},{"$f":"IF('DV - P'!E14=\"\",\"\",'DV - P'!E14)","v":""},{"$f":"IF('DV - P'!I14=\"\",\"\",'DV - P'!I14)","v":""},{"$f":"IF('DV - P'!N14=\"\",\"\",'DV - P'!N14)","v":""},null,{"$f":"IF('DV - P'!P14=\"\",\"\",'DV - P'!P14)","v":""}]
[null,{"$f":"IF('DV - P'!C15=\"\",\"\",'DV - P'!W15)","v":""},{"$f":"IF('DV - P'!C15=\"\",\"\",'DV - P'!B15)","v":""},{"$f":"IF('DV - P'!C15=\"\",\"\",'DV - P'!C15)","v":""},{"$f":"IF('DV - P'!D15=\"\",\"\",'DV - P'!D15)","v":""},{"$f":"IF('DV - P'!E15=\"\",\"\",'DV - P'!E15)","v":""},{"$f":"IF('DV - P'!I15=\"\",\"\",'DV - P'!I15)","v":""},{"$f":"IF('DV - P'!N15=\"\",\"\",'DV - P'!N15)","v":""},null,{"$f":"IF('DV - P'!P15=\"\",\"\",'DV - P'!P15)","v":""}]
[null,{"$f":"IF('DV - P'!C16=\"\",\"\",'DV - P'!W16)","v":""},{"$f":"IF('DV - P'!C16=\"\",\"\",'DV - P'!B16)","v":""},{"$f":"IF('DV - P'!C16=\"\",\"\",'DV - P'!C16)","v":""},{"$f":"IF('DV - P'!D16=\"\",\"\",'DV - P'!D16)","v":""},{"$f":"IF('DV - P'!E16=\"\",\"\",'DV - P'!E16)","v":""},{"$f":"IF('DV - P'!I16=\"\",\"\",'DV - P'!I16)","v":""},{"$f":"IF('DV - P'!N16=\"\",\"\",'DV - P'!N16)","v":""},null,{"$f":"IF('DV - P'!P16=\"\",\"\",'DV - P'!P16)","v":""}]
[null,{"$f":"IF('DV - P'!C17=\"\",\"\",'DV - P'!W17)","v":""},{"$f":"IF('DV - P'!C17=\"\",\"\",'DV - P'!B17)","v":""},{"$f":"IF('DV - P'!C17=\"\",\"\",'DV - P'!C17)","v":""},{"$f":"IF('DV - P'!D17=\"\",\"\",'DV - P'!D17)","v":""},{"$f":"IF('DV - P'!E17=\"\",\"\",'DV - P'!E17)","v":""},{"$f":"IF('DV - P'!I17=\"\",\"\",'DV - P'!I17)","v":""},{"$f":"IF('DV - P'!N17=\"\",\"\",'DV - P'!N17)","v":""},null,{"$f":"IF('DV - P'!P17=\"\",\"\",'DV - P'!P17)","v":""}]
[null,{"$f":"IF('DV - P'!C18=\"\",\"\",'DV - P'!W18)","v":""},{"$f":"IF('DV - P'!C18=\"\",\"\",'DV - P'!B18)","v":""},{"$f":"IF('DV - P'!C18=\"\",\"\",'DV - P'!C18)","v":""},{"$f":"IF('DV - P'!D18=\"\",\"\",'DV - P'!D18)","v":""},{"$f":"IF('DV - P'!E18=\"\",\"\",'DV - P'!E18)","v":""},{"$f":"IF('DV - P'!I18=\"\",\"\",'DV - P'!I18)","v":""},{"$f":"IF('DV - P'!N18=\"\",\"\",'DV - P'!N18)","v":""},null,{"$f":"IF('DV - P'!P18=\"\",\"\",'DV - P'!P18)","v":""}]
[null,{"$f":"IF('DV - P'!C19=\"\",\"\",'DV - P'!W19)","v":""},{"$f":"IF('DV - P'!C19=\"\",\"\",'DV - P'!B19)","v":""},{"$f":"IF('DV - P'!C19=\"\",\"\",'DV - P'!C19)","v":""},{"$f":"IF('DV - P'!D19=\"\",\"\",'DV - P'!D19)","v":""},{"$f":"IF('DV - P'!E19=\"\",\"\",'DV - P'!E19)","v":""},{"$f":"IF('DV - P'!I19=\"\",\"\",'DV - P'!I19)","v":""},{"$f":"IF('DV - P'!N19=\"\",\"\",'DV - P'!N19)","v":""},null,{"$f":"IF('DV - P'!P19=\"\",\"\",'DV - P'!P19)","v":""}]
[null,{"$f":"IF('DV - P'!C20=\"\",\"\",'DV - P'!W20)","v":""},{"$f":"IF('DV - P'!C20=\"\",\"\",'DV - P'!B20)","v":""},{"$f":"IF('DV - P'!C20=\"\",\"\",'DV - P'!C20)","v":""},{"$f":"IF('DV - P'!D20=\"\",\"\",'DV - P'!D20)","v":""},{"$f":"IF('DV - P'!E20=\"\",\"\",'DV - P'!E20)","v":""},{"$f":"IF('DV - P'!I20=\"\",\"\",'DV - P'!I20)","v":""},{"$f":"IF('DV - P'!N20=\"\",\"\",'DV - P'!N20)","v":""},null,{"$f":"IF('DV - P'!P20=\"\",\"\",'DV - P'!P20)","v":""}]
[null,{"$f":"IF('DV - P'!C21=\"\",\"\",'DV - P'!W21)","v":""},{"$f":"IF('DV - P'!C21=\"\",\"\",'DV - P'!B21)","v":""},{"$f":"IF('DV - P'!C21=\"\",\"\",'DV - P'!C21)","v":""},{"$f":"IF('DV - P'!D21=\"\",\"\",'DV - P'!D21)","v":""},{"$f":"IF('DV - P'!E21=\"\",\"\",'DV - P'!E21)","v":""},{"$f":"IF('DV - P'!I21=\"\",\"\",'DV - P'!I21)","v":""},{"$f":"IF('DV - P'!N21=\"\",\"\",'DV - P'!N21)","v":""},null,{"$f":"IF('DV - P'!P21=\"\",\"\",'DV - P'!P21)","v":""}]
[null,{"$f":"IF('DV - P'!C22=\"\",\"\",'DV - P'!W22)","v":""},{"$f":"IF('DV - P'!C22=\"\",\"\",'DV - P'!B22)","v":""},{"$f":"IF('DV - P'!C22=\"\",\"\",'DV - P'!C22)","v":""},{"$f":"IF('DV - P'!D22=\"\",\"\",'DV - P'!D22)","v":""},{"$f":"IF('DV - P'!E22=\"\",\"\",'DV - P'!E22)","v":""},{"$f":"IF('DV - P'!I22=\"\",\"\",'DV - P'!I22)","v":""},{"$f":"IF('DV - P'!N22=\"\",\"\",'DV - P'!N22)","v":""},null,{"$f":"IF('DV - P'!P22=\"\",\"\",'DV - P'!P22)","v":""}]
[null,{"$f":"IF('DV - P'!C23=\"\",\"\",'DV - P'!W23)","v":""},{"$f":"IF('DV - P'!C23=\"\",\"\",'DV - P'!B23)","v":""},{"$f":"IF('DV - P'!C23=\"\",\"\",'DV - P'!C23)","v":""},{"$f":"IF('DV - P'!D23=\"\",\"\",'DV - P'!D23)","v":""},{"$f":"IF('DV - P'!E23=\"\",\"\",'DV - P'!E23)","v":""},{"$f":"IF('DV - P'!I23=\"\",\"\",'DV - P'!I23)","v":""},{"$f":"IF('DV - P'!N23=\"\",\"\",'DV - P'!N23)","v":""},null,{"$f":"IF('DV - P'!P23=\"\",\"\",'DV - P'!P23)","v":""}]
[null,{"$f":"IF('DV - P'!C24=\"\",\"\",'DV - P'!W24)","v":""},{"$f":"IF('DV - P'!C24=\"\",\"\",'DV - P'!B24)","v":""},{"$f":"IF('DV - P'!C24=\"\",\"\",'DV - P'!C24)","v":""},{"$f":"IF('DV - P'!D24=\"\",\"\",'DV - P'!D24)","v":""},{"$f":"IF('DV - P'!E24=\"\",\"\",'DV - P'!E24)","v":""},{"$f":"IF('DV - P'!I24=\"\",\"\",'DV - P'!I24)","v":""},{"$f":"IF('DV - P'!N24=\"\",\"\",'DV - P'!N24)","v":""},null,{"$f":"IF('DV - P'!P24=\"\",\"\",'DV - P'!P24)","v":""}]
[null,{"$f":"IF('DV - P'!C25=\"\",\"\",'DV - P'!W25)","v":""},{"$f":"IF('DV - P'!C25=\"\",\"\",'DV - P'!B25)","v":""},{"$f":"IF('DV - P'!C25=\"\",\"\",'DV - P'!C25)","v":""},{"$f":"IF('DV - P'!D25=\"\",\"\",'DV - P'!D25)","v":""},{"$f":"IF('DV - P'!E25=\"\",\"\",'DV - P'!E25)","v":""},{"$f":"IF('DV - P'!I25=\"\",\"\",'DV - P'!I25)","v":""},{"$f":"IF('DV - P'!N25=\"\",\"\",'DV - P'!N25)","v":""},null,{"$f":"IF('DV - P'!P25=\"\",\"\",'DV - P'!P25)","v":""}]
[null,{"$f":"IF('DV - P'!C26=\"\",\"\",'DV - P'!W26)","v":""},{"$f":"IF('DV - P'!C26=\"\",\"\",'DV - P'!B26)","v":""},{"$f":"IF('DV - P'!C26=\"\",\"\",'DV - P'!C26)","v":""},{"$f":"IF('DV - P'!D26=\"\",\"\",'DV - P'!D26)","v":""},{"$f":"IF('DV - P'!E26=\"\",\"\",'DV - P'!E26)","v":""},{"$f":"IF('DV - P'!I26=\"\",\"\",'DV - P'!I26)","v":""},{"$f":"IF('DV - P'!N26=\"\",\"\",'DV - P'!N26)","v":""},null,{"$f":"IF('DV - P'!P26=\"\",\"\",'DV - P'!P26)","v":""}]
[null,{"$f":"IF('DV - P'!C27=\"\",\"\",'DV - P'!W27)","v":""},{"$f":"IF('DV - P'!C27=\"\",\"\",'DV - P'!B27)","v":""},{"$f":"IF('DV - P'!C27=\"\",\"\",'DV - P'!C27)","v":""},{"$f":"IF('DV - P'!D27=\"\",\"\",'DV - P'!D27)","v":""},{"$f":"IF('DV - P'!E27=\"\",\"\",'DV - P'!E27)","v":""},{"$f":"IF('DV - P'!I27=\"\",\"\",'DV - P'!I27)","v":""},{"$f":"IF('DV - P'!N27=\"\",\"\",'DV - P'!N27)","v":""},null,{"$f":"IF('DV - P'!P27=\"\",\"\",'DV - P'!P27)","v":""}]
[null,{"$f":"IF('DV - P'!C28=\"\",\"\",'DV - P'!W28)","v":""},{"$f":"IF('DV - P'!C28=\"\",\"\",'DV - P'!B28)","v":""},{"$f":"IF('DV - P'!C28=\"\",\"\",'DV - P'!C28)","v":""},{"$f":"IF('DV - P'!D28=\"\",\"\",'DV - P'!D28)","v":""},{"$f":"IF('DV - P'!E28=\"\",\"\",'DV - P'!E28)","v":""},{"$f":"IF('DV - P'!I28=\"\",\"\",'DV - P'!I28)","v":""},{"$f":"IF('DV - P'!N28=\"\",\"\",'DV - P'!N28)","v":""},null,{"$f":"IF('DV - P'!P28=\"\",\"\",'DV - P'!P28)","v":""}]
[null,{"$f":"IF('DV - P'!C29=\"\",\"\",'DV - P'!W29)","v":""},{"$f":"IF('DV - P'!C29=\"\",\"\",'DV - P'!B29)","v":""},{"$f":"IF('DV - P'!C29=\"\",\"\",'DV - P'!C29)","v":""},{"$f":"IF('DV - P'!D29=\"\",\"\",'DV - P'!D29)","v":""},{"$f":"IF('DV - P'!E29=\"\",\"\",'DV - P'!E29)","v":""},{"$f":"IF('DV - P'!I29=\"\",\"\",'DV - P'!I29)","v":""},{"$f":"IF('DV - P'!N29=\"\",\"\",'DV - P'!N29)","v":""},null,{"$f":"IF('DV - P'!P29=\"\",\"\",'DV - P'!P29)","v":""}]
[null,{"$f":"IF('DV - P'!C30=\"\",\"\",'DV - P'!W30)","v":""},{"$f":"IF('DV - P'!C30=\"\",\"\",'DV - P'!B30)","v":""},{"$f":"IF('DV - P'!C30=\"\",\"\",'DV - P'!C30)","v":""},{"$f":"IF('DV - P'!D30=\"\",\"\",'DV - P'!D30)","v":""},{"$f":"IF('DV - P'!E30=\"\",\"\",'DV - P'!E30)","v":""},{"$f":"IF('DV - P'!I30=\"\",\"\",'DV - P'!I30)","v":""},{"$f":"IF('DV - P'!N30=\"\",\"\",'DV - P'!N30)","v":""},null,{"$f":"IF('DV - P'!P30=\"\",\"\",'DV - P'!P30)","v":""}]
[null,{"$f":"IF('DV - P'!C31=\"\",\"\",'DV - P'!W31)","v":""},{"$f":"IF('DV - P'!C31=\"\",\"\",'DV - P'!B31)","v":""},{"$f":"IF('DV - P'!C31=\"\",\"\",'DV - P'!C31)","v":""},{"$f":"IF('DV - P'!D31=\"\",\"\",'DV - P'!D31)","v":""},{"$f":"IF('DV - P'!E31=\"\",\"\",'DV - P'!E31)","v":""},{"$f":"IF('DV - P'!I31=\"\",\"\",'DV - P'!I31)","v":""},{"$f":"IF('DV - P'!N31=\"\",\"\",'DV - P'!N31)","v":""},null,{"$f":"IF('DV - P'!P31=\"\",\"\",'DV - P'!P31)","v":""}]
[null,{"$f":"IF('DV - P'!C32=\"\",\"\",'DV - P'!W32)","v":""},{"$f":"IF('DV - P'!C32=\"\",\"\",'DV - P'!B32)","v":""},{"$f":"IF('DV - P'!C32=\"\",\"\",'DV - P'!C32)","v":""},{"$f":"IF('DV - P'!D32=\"\",\"\",'DV - P'!D32)","v":""},{"$f":"IF('DV - P'!E32=\"\",\"\",'DV - P'!E32)","v":""},{"$f":"IF('DV - P'!I32=\"\",\"\",'DV - P'!I32)","v":""},{"$f":"IF('DV - P'!N32=\"\",\"\",'DV - P'!N32)","v":""},null,{"$f":"IF('DV - P'!P32=\"\",\"\",'DV - P'!P32)","v":""}]
[null,{"$f":"IF('DV - P'!C33=\"\",\"\",'DV - P'!W33)","v":""},{"$f":"IF('DV - P'!C33=\"\",\"\",'DV - P'!B33)","v":""},{"$f":"IF('DV - P'!C33=\"\",\"\",'DV - P'!C33)","v":""},{"$f":"IF('DV - P'!D33=\"\",\"\",'DV - P'!D33)","v":""},{"$f":"IF('DV - P'!E33=\"\",\"\",'DV - P'!E33)","v":""},{"$f":"IF('DV - P'!I33=\"\",\"\",'DV - P'!I33)","v":""},{"$f":"IF('DV - P'!N33=\"\",\"\",'DV - P'!N33)","v":""},null,{"$f":"IF('DV - P'!P33=\"\",\"\",'DV - P'!P33)","v":""}]
[null,{"$f":"IF('DV - P'!C34=\"\",\"\",'DV - P'!W34)","v":""},{"$f":"IF('DV - P'!C34=\"\",\"\",'DV - P'!B34)","v":""},{"$f":"IF('DV - P'!C34=\"\",\"\",'DV - P'!C34)","v":""},{"$f":"IF('DV - P'!D34=\"\",\"\",'DV - P'!D34)","v":""},{"$f":"IF('DV - P'!E34=\"\",\"\",'DV - P'!E34)","v":""},{"$f":"IF('DV - P'!I34=\"\",\"\",'DV - P'!I34)","v":""},{"$f":"IF('DV - P'!N34=\"\",\"\",'DV - P'!N34)","v":""},null,{"$f":"IF('DV - P'!P34=\"\",\"\",'DV - P'!P34)","v":""}]
[null,{"$f":"IF('DV - P'!C35=\"\",\"\",'DV - P'!W35)","v":""},{"$f":"IF('DV - P'!C35=\"\",\"\",'DV - P'!B35)","v":""},{"$f":"IF('DV - P'!C35=\"\",\"\",'DV - P'!C35)","v":""},{"$f":"IF('DV - P'!D35=\"\",\"\",'DV - P'!D35)","v":""},{"$f":"IF('DV - P'!E35=\"\",\"\",'DV - P'!E35)","v":""},{"$f":"IF('DV - P'!I35=\"\",\"\",'DV - P'!I35)","v":""},{"$f":"IF('DV - P'!N35=\"\",\"\",'DV - P'!N35)","v":""},null,{"$f":"IF('DV - P'!P35=\"\",\"\",'DV - P'!P35)","v":""}]
[null,{"$f":"IF('DV - P'!C36=\"\",\"\",'DV - P'!W36)","v":""},{"$f":"IF('DV - P'!C36=\"\",\"\",'DV - P'!B36)","v":""},{"$f":"IF('DV - P'!C36=\"\",\"\",'DV - P'!C36)","v":""},{"$f":"IF('DV - P'!D36=\"\",\"\",'DV - P'!D36)","v":""},{"$f":"IF('DV - P'!E36=\"\",\"\",'DV - P'!E36)","v":""},{"$f":"IF('DV - P'!I36=\"\",\"\",'DV - P'!I36)","v":""},{"$f":"IF('DV - P'!N36=\"\",\"\",'DV - P'!N36)","v":""},null,{"$f":"IF('DV - P'!P36=\"\",\"\",'DV - P'!P36)","v":""}]
[null,{"$f":"IF('DV - P'!C37=\"\",\"\",'DV - P'!W37)","v":""},{"$f":"IF('DV - P'!C37=\"\",\"\",'DV - P'!B37)","v":""},{"$f":"IF('DV - P'!C37=\"\",\"\",'DV - P'!C37)","v":""},{"$f":"IF('DV - P'!D37=\"\",\"\",'DV - P'!D37)","v":""},{"$f":"IF('DV - P'!E37=\"\",\"\",'DV - P'!E37)","v":""},{"$f":"IF('DV - P'!I37=\"\",\"\",'DV - P'!I37)","v":""},{"$f":"IF('DV - P'!N37=\"\",\"\",'DV - P'!N37)","v":""},null,{"$f":"IF('DV - P'!P37=\"\",\"\",'DV - P'!P37)","v":""}]
[null,{"$f":"IF('DV - P'!C38=\"\",\"\",'DV - P'!W38)","v":""},{"$f":"IF('DV - P'!C38=\"\",\"\",'DV - P'!B38)","v":""},{"$f":"IF('DV - P'!C38=\"\",\"\",'DV - P'!C38)","v":""},{"$f":"IF('DV - P'!D38=\"\",\"\",'DV - P'!D38)","v":""},{"$f":"IF('DV - P'!E38=\"\",\"\",'DV - P'!E38)","v":""},{"$f":"IF('DV - P'!I38=\"\",\"\",'DV - P'!I38)","v":""},{"$f":"IF('DV - P'!N38=\"\",\"\",'DV - P'!N38)","v":""},null,{"$f":"IF('DV - P'!P38=\"\",\"\",'DV - P'!P38)","v":""}]
[null,{"$f":"IF('DV - P'!C39=\"\",\"\",'DV - P'!W39)","v":""},{"$f":"IF('DV - P'!C39=\"\",\"\",'DV - P'!B39)","v":""},{"$f":"IF('DV - P'!C39=\"\",\"\",'DV - P'!C39)","v":""},{"$f":"IF('DV - P'!D39=\"\",\"\",'DV - P'!D39)","v":""},{"$f":"IF('DV - P'!E39=\"\",\"\",'DV - P'!E39)","v":""},{"$f":"IF('DV - P'!I39=\"\",\"\",'DV - P'!I39)","v":""},{"$f":"IF('DV - P'!N39=\"\",\"\",'DV - P'!N39)","v":""},null,{"$f":"IF('DV - P'!P39=\"\",\"\",'DV - P'!P39)","v":""}]
[null,{"$f":"IF('DV - P'!C40=\"\",\"\",'DV - P'!W40)","v":""},{"$f":"IF('DV - P'!C40=\"\",\"\",'DV - P'!B40)","v":""},{"$f":"IF('DV - P'!C40=\"\",\"\",'DV - P'!C40)","v":""},{"$f":"IF('DV - P'!D40=\"\",\"\",'DV - P'!D40)","v":""},{"$f":"IF('DV - P'!E40=\"\",\"\",'DV - P'!E40)","v":""},{"$f":"IF('DV - P'!I40=\"\",\"\",'DV - P'!I40)","v":""},{"$f":"IF('DV - P'!N40=\"\",\"\",'DV - P'!N40)","v":""},null,{"$f":"IF('DV - P'!P40=\"\",\"\",'DV - P'!P40)","v":""}]
[null,{"$f":"IF('DV - P'!C41=\"\",\"\",'DV - P'!W41)","v":""},{"$f":"IF('DV - P'!C41=\"\",\"\",'DV - P'!B41)","v":""},{"$f":"IF('DV - P'!C41=\"\",\"\",'DV - P'!C41)","v":""},{"$f":"IF('DV - P'!D41=\"\",\"\",'DV - P'!D41)","v":""},{"$f":"IF('DV - P'!E41=\"\",\"\",'DV - P'!E41)","v":""},{"$f":"IF('DV - P'!I41=\"\",\"\",'DV - P'!I41)","v":""},{"$f":"IF('DV - P'!N41=\"\",\"\",'DV - P'!N41)","v":""},null,{"$f":"IF('DV - P'!P41=\"\",\"\",'DV - P'!P41)","v":""}]
[null,{"$f":"IF('DV - P'!C42=\"\",\"\",'DV - P'!W42)","v":""},{"$f":"IF('DV - P'!C42=\"\",\"\",'DV - P'!B42)","v":""},{"$f":"IF('DV - P'!C42=\"\",\"\",'DV - P'!C42)","v":""},{"$f":"IF('DV - P'!D42=\"\",\"\",'DV - P'!D42)","v":""},{"$f":"IF('DV - P'!E42=\"\",\"\",'DV - P'!E42)","v":""},{"$f":"IF('DV - P'!I42=\"\",\"\",'DV - P'!I42)","v":""},{"$f":"IF('DV - P'!N42=\"\",\"\",'DV - P'!N42)","v":""},null,{"$f":"IF('DV - P'!P42=\"\",\"\",'DV - P'!P42)","v":""}]
[null,{"$f":"IF('DV - P'!C43=\"\",\"\",'DV - P'!W43)","v":""},{"$f":"IF('DV - P'!C43=\"\",\"\",'DV - P'!B43)","v":""},{"$f":"IF('DV - P'!C43=\"\",\"\",'DV - P'!C43)","v":""},{"$f":"IF('DV - P'!D43=\"\",\"\",'DV - P'!D43)","v":""},{"$f":"IF('DV - P'!E43=\"\",\"\",'DV - P'!E43)","v":""},{"$f":"IF('DV - P'!I43=\"\",\"\",'DV - P'!I43)","v":""},{"$f":"IF('DV - P'!N43=\"\",\"\",'DV - P'!N43)","v":""},null,{"$f":"IF('DV - P'!P43=\"\",\"\",'DV - P'!P43)","v":""}]
[null,{"$f":"IF('DV - P'!C44=\"\",\"\",'DV - P'!W44)","v":""},{"$f":"IF('DV - P'!C44=\"\",\"\",'DV - P'!B44)","v":""},{"$f":"IF('DV - P'!C44=\"\",\"\",'DV - P'!C44)","v":""},{"$f":"IF('DV - P'!D44=\"\",\"\",'DV - P'!D44)","v":""},{"$f":"IF('DV - P'!E44=\"\",\"\",'DV - P'!E44)","v":""},{"$f":"IF('DV - P'!I44=\"\",\"\",'DV - P'!I44)","v":""},{"$f":"IF('DV - P'!N44=\"\",\"\",'DV - P'!N44)","v":""},null,{"$f":"IF('DV - P'!P44=\"\",\"\",'DV - P'!P44)","v":""}]
[null,{"$f":"IF('DV - P'!C45=\"\",\"\",'DV - P'!W45)","v":""},{"$f":"IF('DV - P'!C45=\"\",\"\",'DV - P'!B45)","v":""},{"$f":"IF('DV - P'!C45=\"\",\"\",'DV - P'!C45)","v":""},{"$f":"IF('DV - P'!D45=\"\",\"\",'DV - P'!D45)","v":""},{"$f":"IF('DV - P'!E45=\"\",\"\",'DV - P'!E45)","v":""},{"$f":"IF('DV - P'!I45=\"\",\"\",'DV - P'!I45)","v":""},{"$f":"IF('DV - P'!N45=\"\",\"\",'DV - P'!N45)","v":""},null,{"$f":"IF('DV - P'!P45=\"\",\"\",'DV - P'!P45)","v":""}]
[null,{"$f":"IF('DV - P'!C46=\"\",\"\",'DV - P'!W46)","v":""},{"$f":"IF('DV - P'!C46=\"\",\"\",'DV - P'!B46)","v":""},{"$f":"IF('DV - P'!C46=\"\",\"\",'DV - P'!C46)","v":""},{"$f":"IF('DV - P'!D46=\"\",\"\",'DV - P'!D46)","v":""},{"$f":"IF('DV - P'!E46=\"\",\"\",'DV - P'!E46)","v":""},{"$f":"IF('DV - P'!I46=\"\",\"\",'DV - P'!I46)","v":""},{"$f":"IF('DV - P'!N46=\"\",\"\",'DV - P'!N46)","v":""},null,{"$f":"IF('DV - P'!P46=\"\",\"\",'DV - P'!P46)","v":""}]
[null,{"$f":"IF('DV - P'!C47=\"\",\"\",'DV - P'!W47)","v":""},{"$f":"IF('DV - P'!C47=\"\",\"\",'DV - P'!B47)","v":""},{"$f":"IF('DV - P'!C47=\"\",\"\",'DV - P'!C47)","v":""},{"$f":"IF('DV - P'!D47=\"\",\"\",'DV - P'!D47)","v":""},{"$f":"IF('DV - P'!E47=\"\",\"\",'DV - P'!E47)","v":""},{"$f":"IF('DV - P'!I47=\"\",\"\",'DV - P'!I47)","v":""},{"$f":"IF('DV - P'!N47=\"\",\"\",'DV - P'!N47)","v":""},null,{"$f":"IF('DV - P'!P47=\"\",\"\",'DV - P'!P47)","v":""}]
[null,{"$f":"IF('DV - P'!C48=\"\",\"\",'DV - P'!W48)","v":""},{"$f":"IF('DV - P'!C48=\"\",\"\",'DV - P'!B48)","v":""},{"$f":"IF('DV - P'!C48=\"\",\"\",'DV - P'!C48)","v":""},{"$f":"IF('DV - P'!D48=\"\",\"\",'DV - P'!D48)","v":""},{"$f":"IF('DV - P'!E48=\"\",\"\",'DV - P'!E48)","v":""},{"$f":"IF('DV - P'!I48=\"\",\"\",'DV - P'!I48)","v":""},{"$f":"IF('DV - P'!N48=\"\",\"\",'DV - P'!N48)","v":""},null,{"$f":"IF('DV - P'!P48=\"\",\"\",'DV - P'!P48)","v":""}]
[null,{"$f":"IF('DV - P'!C49=\"\",\"\",'DV - P'!W49)","v":""},{"$f":"IF('DV - P'!C49=\"\",\"\",'DV - P'!B49)","v":""},{"$f":"IF('DV - P'!C49=\"\",\"\",'DV - P'!C49)","v":""},{"$f":"IF('DV - P'!D49=\"\",\"\",'DV - P'!D49)","v":""},{"$f":"IF('DV - P'!E49=\"\",\"\",'DV - P'!E49)","v":""},{"$f":"IF('DV - P'!I49=\"\",\"\",'DV - P'!I49)","v":""},{"$f":"IF('DV - P'!N49=\"\",\"\",'DV - P'!N49)","v":""},null,{"$f":"IF('DV - P'!P49=\"\",\"\",'DV - P'!P49)","v":""}]
[null,{"$f":"IF('DV - P'!C50=\"\",\"\",'DV - P'!W50)","v":""},{"$f":"IF('DV - P'!C50=\"\",\"\",'DV - P'!B50)","v":""},{"$f":"IF('DV - P'!C50=\"\",\"\",'DV - P'!C50)","v":""},{"$f":"IF('DV - P'!D50=\"\",\"\",'DV - P'!D50)","v":""},{"$f":"IF('DV - P'!E50=\"\",\"\",'DV - P'!E50)","v":""},{"$f":"IF('DV - P'!I50=\"\",\"\",'DV - P'!I50)","v":""},{"$f":"IF('DV - P'!N50=\"\",\"\",'DV - P'!N50)","v":""},null,{"$f":"IF('DV - P'!P50=\"\",\"\",'DV - P'!P50)","v":""}]

{"sheet":"TEST","index":13,"n_rows":54,"n_cols":10,"rows_kept":54,"cut":false,"hidden":false,"merged":[[0,1,0,9]]}
[null,"TEST"]
[]
[null,null,{"$f":"Start!$D$5","v":"Dorky - Střední"}]
[null,"st.č.","Jméno","SDH",{"$f":"Start!$F$6","v":"Okres"},"Tr.b.",null,"Poř.",null,"Poř."]
[null,{"$f":"Start!C7","v":1},{"$f":"IF(Start!D7=\"\",\"\",Start!D7)","v":"Klára Trmotová"},{"$f":"IF(Start!E7=\"\",\"\",Start!E7)","v":"Dlažov"},{"$f":"IF(Start!F7=\"\",\"\",Start!F7)","v":"KT"},0,null,{"$f":"IF(C5=\"\",\"\",IF(F5=\"\",\"DNF\",IF(OR(F5=\"NP\",F5=\"DNF\"),F5,RANK(F5,F$5:F$54,1))))","v":1},null,{"$f":"IF(C5=\"\",\"\",IF(OR(H5=\"NP\",H5=\"DNF\"),IF(H5=\"NP\",MAX(H$5:H$54)+COUNTIF((H$5:H$54),MAX(H$5:H$54)),MAX(H$5:H$54)+COUNTIF((H$5:H$54),MAX(H$5:H$54))+COUNTIF((H$5:H$54),\"NP\")),H5))","v":1}]
[null,{"$f":"Start!C8","v":2},{"$f":"IF(Start!D8=\"\",\"\",Start!D8)","v":"Tereza Grünerová "},{"$f":"IF(Start!E8=\"\",\"\",Start!E8)","v":"Brod nad Tichou"},{"$f":"IF(Start!F8=\"\",\"\",Start!F8)","v":"TA"},0,null,1,null,1]
[null,{"$f":"Start!C9","v":3},{"$f":"IF(Start!D9=\"\",\"\",Start!D9)","v":"Iva Babková"},{"$f":"IF(Start!E9=\"\",\"\",Start!E9)","v":"Bystřice nad Úhlavou"},{"$f":"IF(Start!F9=\"\",\"\",Start!F9)","v":"KT"},0,null,1,null,1]
[null,{"$f":"Start!C10","v":4},{"$f":"IF(Start!D10=\"\",\"\",Start!D10)","v":"Michaela Marešová"},{"$f":"IF(Start!E10=\"\",\"\",Start!E10)","v":"Planá"},{"$f":"IF(Start!F10=\"\",\"\",Start!F10)","v":"TA"},0,null,1,null,1]
[null,{"$f":"Start!C11","v":5},{"$f":"IF(Start!D11=\"\",\"\",Start!D11)","v":"Adéla Stodolová"},{"$f":"IF(Start!E11=\"\",\"\",Start!E11)","v":"Planá"},{"$f":"IF(Start!F11=\"\",\"\",Start!F11)","v":"TA"},1,null,5,null,5]
[null,{"$f":"Start!C12","v":6},{"$f":"IF(Start!D12=\"\",\"\",Start!D12)","v":""},{"$f":"IF(Start!E12=\"\",\"\",Start!E12)","v":""},{"$f":"IF(Start!F12=\"\",\"\",Start!F12)","v":""},null,null,"",null,""]
[null,{"$f":"Start!C13","v":7},{"$f":"IF(Start!D13=\"\",\"\",Start!D13)","v":""},{"$f":"IF(Start!E13=\"\",\"\",Start!E13)","v":""},{"$f":"IF(Start!F13=\"\",\"\",Start!F13)","v":""},null,null,"",null,""]
[null,{"$f":"Start!C14","v":8},{"$f":"IF(Start!D14=\"\",\"\",Start!D14)","v":""},{"$f":"IF(Start!E14=\"\",\"\",Start!E14)","v":""},{"$f":"IF(Start!F14=\"\",\"\",Start!F14)","v":""},null,null,"",null,""]
[null,{"$f":"Start!C15","v":9},{"$f":"IF(Start!D15=\"\",\"\",Start!D15)","v":""},{"$f":"IF(Start!E15=\"\",\"\",Start!E15)","v":""},{"$f":"IF(Start!F15=\"\",\"\",Start!F15)","v":""},null,null,"",null,""]
[null,{"$f":"Start!C16","v":10},{"$f":"IF(Start!D16=\"\",\"\",Start!D16)","v":""},{"$f":"IF(Start!E16=\"\",\"\",Start!E16)","v":""},{"$f":"IF(Start!F16=\"\",\"\",Start!F16)","v":""},null,null,"",null,""]
[null,{"$f":"Start!C17","v":11},{"$f":"IF(Start!D17=\"\",\"\",Start!D17)","v":""},{"$f":"IF(Start!E17=\"\",\"\",Start!E17)","v":""},{"$f":"IF(Start!F17=\"\",\"\",Start!F17)","v":""},null,null,"",null,""]
[null,{"$f":"Start!C18","v":12},{"$f":"IF(Start!D18=\"\",\"\",Start!D18)","v":""},{"$f":"IF(Start!E18=\"\",\"\",Start!E18)","v":""},{"$f":"IF(Start!F18=\"\",\"\",Start!F18)","v":""},null,null,"",null,""]
[null,{"$f":"Start!C19","v":13},{"$f":"IF(Start!D19=\"\",\"\",Start!D19)","v":""},{"$f":"IF(Start!E19=\"\",\"\",Start!E19)","v":""},{"$f":"IF(Start!F19=\"\",\"\",Start!F19)","v":""},null,null,"",null,""]
[null,{"$f":"Start!C20","v":14},{"$f":"IF(Start!D20=\"\",\"\",Start!D20)","v":""},{"$f":"IF(Start!E20=\"\",\"\",Start!E20)","v":""},{"$f":"IF(Start!F20=\"\",\"\",Start!F20)","v":""},null,null,"",null,""]
[null,{"$f":"Start!C21","v":15},{"$f":"IF(Start!D21=\"\",\"\",Start!D21)","v":""},{"$f":"IF(Start!E21=\"\",\"\",Start!E21)","v":""},{"$f":"IF(Start!F21=\"\",\"\",Start!F21)","v":""},null,null,"",null,""]
[null,{"$f":"Start!C22","v":16},{"$f":"IF(Start!D22=\"\",\"\",Start!D22)","v":""},{"$f":"IF(Start!E22=\"\",\"\",Start!E22)","v":""},{"$f":"IF(Start!F22=\"\",\"\",Start!F22)","v":""},null,null,"",null,""]
[null,{"$f":"Start!C23","v":17},{"$f":"IF(Start!D23=\"\",\"\",Start!D23)","v":""},{"$f":"IF(Start!E23=\"\",\"\",Start!E23)","v":""},{"$f":"IF(Start!F23=\"\",\"\",Start!F23)","v":""},null,null,"",null,""]
[null,{"$f":"Start!C24","v":18},{"$f":"IF(Start!D24=\"\",\"\",Start!D24)","v":""},{"$f":"IF(Start!E24=\"\",\"\",Start!E24)","v":""},{"$f":"IF(Start!F24=\"\",\"\",Start!F24)","v":""},null,null,"",null,""]
[null,{"$f":"Start!C25","v":19},{"$f":"IF(Start!D25=\"\",\"\",Start!D25)","v":""},{"$f":"IF(Start!E25=\"\",\"\",Start!E25)","v":""},{"$f":"IF(Start!F25=\"\",\"\",Start!F25)","v":""},null,null,"",null,""]
[null,{"$f":"Start!C26","v":20},{"$f":"IF(Start!D26=\"\",\"\",Start!D26)","v":""},{"$f":"IF(Start!E26=\"\",\"\",Start!E26)","v":""},{"$f":"IF(Start!F26=\"\",\"\",Start!F26)","v":""},null,null,"",null,""]
[null,{"$f":"Start!C27","v":21},{"$f":"IF(Start!D27=\"\",\"\",Start!D27)","v":""},{"$f":"IF(Start!E27=\"\",\"\",Start!E27)","v":""},{"$f":"IF(Start!F27=\"\",\"\",Start!F27)","v":""},null,null,"",null,""]
[null,{"$f":"Start!C28","v":22},{"$f":"IF(Start!D28=\"\",\"\",Start!D28)","v":""},{"$f":"IF(Start!E28=\"\",\"\",Start!E28)","v":""},{"$f":"IF(Start!F28=\"\",\"\",Start!F28)","v":""},null,null,"",null,""]
[null,{"$f":"Start!C29","v":23},{"$f":"IF(Start!D29=\"\",\"\",Start!D29)","v":""},{"$f":"IF(Start!E29=\"\",\"\",Start!E29)","v":""},{"$f":"IF(Start!F29=\"\",\"\",Start!F29)","v":""},null,null,"",null,""]
[null,{"$f":"Start!C30","v":24},{"$f":"IF(Start!D30=\"\",\"\",Start!D30)","v":""},{"$f":"IF(Start!E30=\"\",\"\",Start!E30)","v":""},{"$f":"IF(Start!F30=\"\",\"\",Start!F30)","v":""},null,null,"",null,""]
[null,{"$f":"Start!C31","v":25},{"$f":"IF(Start!D31=\"\",\"\",Start!D31)","v":""},{"$f":"IF(Start!E31=\"\",\"\",Start!E31)","v":""},{"$f":"IF(Start!F31=\"\",\"\",Start!F31)","v":""},null,null,"",null,""]
[null,{"$f":"Start!C32","v":26},{"$f":"IF(Start!D32=\"\",\"\",Start!D32)","v":""},{"$f":"IF(Start!E32=\"\",\"\",Start!E32)","v":""},{"$f":"IF(Start!F32=\"\",\"\",Start!F32)","v":""},null,null,"",null,""]
[null,{"$f":"Start!C33","v":27},{"$f":"IF(Start!D33=\"\",\"\",Start!D33)","v":""},{"$f":"IF(Start!E33=\"\",\"\",Start!E33)","v":""},{"$f":"IF(Start!F33=\"\",\"\",Start!F33)","v":""},null,null,"",null,""]
[null,{"$f":"Start!C34","v":28},{"$f":"IF(Start!D34=\"\",\"\",Start!D34)","v":""},{"$f":"IF(Start!E34=\"\",\"\",Start!E34)","v":""},{"$f":"IF(Start!F34=\"\",\"\",Start!F34)","v":""},null,null,"",null,""]
[null,{"$f":"Start!C35","v":29},{"$f":"IF(Start!D35=\"\",\"\",Start!D35)","v":""},{"$f":"IF(Start!E35=\"\",\"\",Start!E35)","v":""},{"$f":"IF(Start!F35=\"\",\"\",Start!F35)","v":""},null,null,"",null,""]
[null,{"$f":"Start!C36","v":30},{"$f":"IF(Start!D36=\"\",\"\",Start!D36)","v":""},{"$f":"IF(Start!E36=\"\",\"\",Start!E36)","v":""},{"$f":"IF(Start!F36=\"\",\"\",Start!F36)","v":""},null,null,"",null,""]
[null,{"$f":"Start!C37","v":31},{"$f":"IF(Start!D37=\"\",\"\",Start!D37)","v":""},{"$f":"IF(Start!E37=\"\",\"\",Start!E37)","v":""},{"$f":"IF(Start!F37=\"\",\"\",Start!F37)","v":""},null,null,"",null,""]
[null,{"$f":"Start!C38","v":32},{"$f":"IF(Start!D38=\"\",\"\",Start!D38)","v":""},{"$f":"IF(Start!E38=\"\",\"\",Start!E38)","v":""},{"$f":"IF(Start!F38=\"\",\"\",Start!F38)","v":""},null,null,"",null,""]
[null,{"$f":"Start!C39","v":33},{"$f":"IF(Start!D39=\"\",\"\",Start!D39)","v":""},{"$f":"IF(Start!E39=\"\",\"\",Start!E39)","v":""},{"$f":"IF(Start!F39=\"\",\"\",Start!F39)","v":""},null,null,{"$f":"IF(C37=\"\",\"\",IF(F37=\"\",\"DNF\",IF(OR(F37=\"NP\",F37=\"DNF\"),F37,RANK(F37,F$5:F$54,1))))","v":""},null,{"$f":"IF(C37=\"\",\"\",IF(OR(H37=\"NP\",H37=\"DNF\"),IF(H37=\"NP\",MAX(H$5:H$54)+COUNTIF((H$5:H$54),MAX(H$5:H$54)),MAX(H$5:H$54)+COUNTIF((H$5:H$54),MAX(H$5:H$54))+COUNTIF((H$5:H$54),\"NP\")),H37))","v":""}]
[null,{"$f":"Start!C40","v":34},{"$f":"IF(Start!D40=\"\",\"\",Start!D40)","v":""},{"$f":"IF(Start!E40=\"\",\"\",Start!E40)","v":""},{"$f":"IF(Start!F40=\"\",\"\",Start!F40)","v":""},null,null,"",null,""]
[null,{"$f":"Start!C41","v":35},{"$f":"IF(Start!D41=\"\",\"\",Start!D41)","v":""},{"$f":"IF(Start!E41=\"\",\"\",Start!E41)","v":""},{"$f":"IF(Start!F41=\"\",\"\",Start!F41)","v":""},null,null,"",null,""]
[null,{"$f":"Start!C42","v":36},{"$f":"IF(Start!D42=\"\",\"\",Start!D42)","v":""},{"$f":"IF(Start!E42=\"\",\"\",Start!E42)","v":""},{"$f":"IF(Start!F42=\"\",\"\",Start!F42)","v":""},null,null,"",null,""]
[null,{"$f":"Start!C43","v":37},{"$f":"IF(Start!D43=\"\",\"\",Start!D43)","v":""},{"$f":"IF(Start!E43=\"\",\"\",Start!E43)","v":""},{"$f":"IF(Start!F43=\"\",\"\",Start!F43)","v":""},null,null,"",null,""]
[null,{"$f":"Start!C44","v":38},{"$f":"IF(Start!D44=\"\",\"\",Start!D44)","v":""},{"$f":"IF(Start!E44=\"\",\"\",Start!E44)","v":""},{"$f":"IF(Start!F44=\"\",\"\",Start!F44)","v":""},null,null,"",null,""]
[null,{"$f":"Start!C45","v":39},{"$f":"IF(Start!D45=\"\",\"\",Start!D45)","v":""},{"$f":"IF(Start!E45=\"\",\"\",Start!E45)","v":""},{"$f":"IF(Start!F45=\"\",\"\",Start!F45)","v":""},null,null,"",null,""]
[null,{"$f":"Start!C46","v":40},{"$f":"IF(Start!D46=\"\",\"\",Start!D46)","v":""},{"$f":"IF(Start!E46=\"\",\"\",Start!E46)","v":""},{"$f":"IF(Start!F46=\"\",\"\",Start!F46)","v":""},null,null,"",null,""]
[null,{"$f":"Start!C47","v":41},{"$f":"IF(Start!D47=\"\",\"\",Start!D47)","v":""},{"$f":"IF(Start!E47=\"\",\"\",Start!E47)","v":""},{"$f":"IF(Start!F47=\"\",\"\",Start!F47)","v":""},null,null,"",null,""]
[null,{"$f":"Start!C48","v":42},{"$f":"IF(Start!D48=\"\",\"\",Start!D48)","v":""},{"$f":"IF(Start!E48=\"\",\"\",Start!E48)","v":""},{"$f":"IF(Start!F48=\"\",\"\",Start!F48)","v":""},null,null,"",null,""]
[null,{"$f":"Start!C49","v":43},{"$f":"IF(Start!D49=\"\",\"\",Start!D49)","v":""},{"$f":"IF(Start!E49=\"\",\"\",Start!E49)","v":""},{"$f":"IF(Start!F49=\"\",\"\",Start!F49)","v":""},null,null,"",null,""]
[null,{"$f":"Start!C50","v":44},{"$f":"IF(Start!D50=\"\",\"\",Start!D50)","v":""},{"$f":"IF(Start!E50=\"\",\"\",Start!E50)","v":""},{"$f":"IF(Start!F50=\"\",\"\",Start!F50)","v":""},null,null,"",null,""]
[null,{"$f":"Start!C51","v":45},{"$f":"IF(Start!D51=\"\",\"\",Start!D51)","v":""},{"$f":"IF(Start!E51=\"\",\"\",Start!E51)","v":""},{"$f":"IF(Start!F51=\"\",\"\",Start!F51)","v":""},null,null,"",null,""]
[null,{"$f":"Start!C52","v":46},{"$f":"IF(Start!D52=\"\",\"\",Start!D52)","v":""},{"$f":"IF(Start!E52=\"\",\"\",Start!E52)","v":""},{"$f":"IF(Start!F52=\"\",\"\",Start!F52)","v":""},null,null,"",null,""]
[null,{"$f":"Start!C53","v":47},{"$f":"IF(Start!D53=\"\",\"\",Start!D53)","v":""},{"$f":"IF(Start!E53=\"\",\"\",Start!E53)","v":""},{"$f":"IF(Start!F53=\"\",\"\",Start!F53)","v":""},null,null,"",null,""]
[null,{"$f":"Start!C54","v":48},{"$f":"IF(Start!D54=\"\",\"\",Start!D54)","v":""},{"$f":"IF(Start!E54=\"\",\"\",Start!E54)","v":""},{"$f":"IF(Start!F54=\"\",\"\",Start!F54)","v":""},null,null,"",null,""]
[null,{"$f":"Start!C55","v":49},{"$f":"IF(Start!D55=\"\",\"\",Start!D55)","v":""},{"$f":"IF(Start!E55=\"\",\"\",Start!E55)","v":""},{"$f":"IF(Start!F55=\"\",\"\",Start!F55)","v":""},null,null,"",null,""]
[null,{"$f":"Start!C56","v":50},{"$f":"IF(Start!D56=\"\",\"\",Start!D56)","v":""},{"$f":"IF(Start!E56=\"\",\"\",Start!E56)","v":""},{"$f":"IF(Start!F56=\"\",\"\",Start!F56)","v":""},null,null,"",null,""]

{"sheet":"Výsledky","index":14,"n_rows":57,"n_cols":17,"rows_kept":57,"cut":false,"hidden":false,"merged":[[2,2,2,14],[0,1,0,15],[3,2,3,14]]}
[null,"Celkové výsledky - Jednotlivci"]
[]
[null,null,{"$f":"Start!$B$2","v":"Krajské kolo soutěží dorostu"}]
[null,null,{"$f":"Start!$B$3","v":"19. června 2021 Tachov"}]
[]
[null,null,{"$f":"Start!$D$5","v":"Dorky - Střední"}]
[null," startovní číslo"," Jméno"," ZPV"," Dvojboj"," Běh na 100m s přek."," Test"," Celkový součet",null," Celokvé pořadí "," Jméno"," ZPV"," Dvojboj"," Běh na 100m s přek."," Test"," Celkový součet"]
[null,{"$f":"Start!C7","v":1},{"$f":"IF(Start!D7=\"\",\"\",Start!D7)","v":"Klára Trmotová"},{"$f":"IF($C8=\"\",\"\",IF(V.l.ZPV!$C$6=\"\",\"0\",IF(ISNA(MATCH($C8,ZPVOblN,0)),COUNTIF(ZPVOblT,\".\")+1,LOOKUP($C8,ZPVOblN,ZPVOblD))))","v":"0"},{"$f":"IF($C8=\"\",\"\",LOOKUP($C8,'DV - P'!$Y$1:$Y$50,'DV - P'!$Z$1:$Z$50))","v":1},{"$f":"IF($C8=\"\",\"\",LOOKUP($C8,'PJ - P'!$Y$1:$Y$50,'PJ - P'!$Z$1:$Z$50))","v":2},{"$f":"IF(C8=\"\",\"\",TEST!J5)","v":1},{"$f":"IF(C8=\"\",\"\",SUM(D8:G8))","v":4},null,1,"Iva Babková","0",1,1,1,3,0]
[null,{"$f":"Start!C8","v":2},{"$f":"IF(Start!D8=\"\",\"\",Start!D8)","v":"Tereza Grünerová "},{"$f":"IF($C9=\"\",\"\",IF(V.l.ZPV!$C$6=\"\",\"0\",IF(ISNA(MATCH($C9,ZPVOblN,0)),COUNTIF(ZPVOblT,\".\")+1,LOOKUP($C9,ZPVOblN,ZPVOblD))))","v":"0"},{"$f":"IF($C9=\"\",\"\",LOOKUP($C9,'DV - P'!$Y$1:$Y$50,'DV - P'!$Z$1:$Z$50))","v":1},{"$f":"IF($C9=\"\",\"\",LOOKUP($C9,'PJ - P'!$Y$1:$Y$50,'PJ - P'!$Z$1:$Z$50))","v":5},{"$f":"IF(C9=\"\",\"\",TEST!J6)","v":1},{"$f":"IF(C9=\"\",\"\",SUM(D9:G9))","v":7},null,2,"Klára Trmotová","0",1,2,1,4,0]
[null,{"$f":"Start!C9","v":3},{"$f":"IF(Start!D9=\"\",\"\",Start!D9)","v":"Iva Babková"},{"$f":"IF($C10=\"\",\"\",IF(V.l.ZPV!$C$6=\"\",\"0\",IF(ISNA(MATCH($C10,ZPVOblN,0)),COUNTIF(ZPVOblT,\".\")+1,LOOKUP($C10,ZPVOblN,ZPVOblD))))","v":"0"},{"$f":"IF($C10=\"\",\"\",LOOKUP($C10,'DV - P'!$Y$1:$Y$50,'DV - P'!$Z$1:$Z$50))","v":1},{"$f":"IF($C10=\"\",\"\",LOOKUP($C10,'PJ - P'!$Y$1:$Y$50,'PJ - P'!$Z$1:$Z$50))","v":1},{"$f":"IF(C10=\"\",\"\",TEST!J7)","v":1},3,null,3,"Michaela Marešová","0",1,3,1,5,0]
[null,{"$f":"Start!C10","v":4},{"$f":"IF(Start!D10=\"\",\"\",Start!D10)","v":"Michaela Marešová"},{"$f":"IF($C11=\"\",\"\",IF(V.l.ZPV!$C$6=\"\",\"0\",IF(ISNA(MATCH($C11,ZPVOblN,0)),COUNTIF(ZPVOblT,\".\")+1,LOOKUP($C11,ZPVOblN,ZPVOblD))))","v":"0"},{"$f":"IF($C11=\"\",\"\",LOOKUP($C11,'DV - P'!$Y$1:$Y$50,'DV - P'!$Z$1:$Z$50))","v":1},{"$f":"IF($C11=\"\",\"\",LOOKUP($C11,'PJ - P'!$Y$1:$Y$50,'PJ - P'!$Z$1:$Z$50))","v":3},{"$f":"IF(C11=\"\",\"\",TEST!J8)","v":1},5,null,4,"Tereza Grünerová ","0",1,5,1,7,0]
[null,{"$f":"Start!C11","v":5},{"$f":"IF(Start!D11=\"\",\"\",Start!D11)","v":"Adéla Stodolová"},{"$f":"IF($C12=\"\",\"\",IF(V.l.ZPV!$C$6=\"\",\"0\",IF(ISNA(MATCH($C12,ZPVOblN,0)),COUNTIF(ZPVOblT,\".\")+1,LOOKUP($C12,ZPVOblN,ZPVOblD))))","v":"0"},{"$f":"IF($C12=\"\",\"\",LOOKUP($C12,'DV - P'!$Y$1:$Y$50,'DV - P'!$Z$1:$Z$50))","v":1},{"$f":"IF($C12=\"\",\"\",LOOKUP($C12,'PJ - P'!$Y$1:$Y$50,'PJ - P'!$Z$1:$Z$50))","v":4},{"$f":"IF(C12=\"\",\"\",TEST!J9)","v":5},10,null,5,"Adéla Stodolová","0",1,4,5,10,0]
[null,{"$f":"Start!C12","v":6},{"$f":"IF(Start!D12=\"\",\"\",Start!D12)","v":""},{"$f":"IF($C13=\"\",\"\",IF(V.l.ZPV!$C$6=\"\",\"0\",IF(ISNA(MATCH($C13,ZPVOblN,0)),COUNTIF(ZPVOblT,\".\")+1,LOOKUP($C13,ZPVOblN,ZPVOblD))))","v":""},{"$f":"IF($C13=\"\",\"\",LOOKUP($C13,'DV - P'!$Y$1:$Y$50,'DV - P'!$Z$1:$Z$50))","v":""},{"$f":"IF($C13=\"\",\"\",LOOKUP($C13,'PJ - P'!$Y$1:$Y$50,'PJ - P'!$Z$1:$Z$50))","v":""},{"$f":"IF(C13=\"\",\"\",TEST!J10)","v":""},"",null,6,"","","","","","",0]
[null,{"$f":"Start!C13","v":7},{"$f":"IF(Start!D13=\"\",\"\",Start!D13)","v":""},{"$f":"IF($C14=\"\",\"\",IF(V.l.ZPV!$C$6=\"\",\"0\",IF(ISNA(MATCH($C14,ZPVOblN,0)),COUNTIF(ZPVOblT,\".\")+1,LOOKUP($C14,ZPVOblN,ZPVOblD))))","v":""},{"$f":"IF($C14=\"\",\"\",LOOKUP($C14,'DV - P'!$Y$1:$Y$50,'DV - P'!$Z$1:$Z$50))","v":""},{"$f":"IF($C14=\"\",\"\",LOOKUP($C14,'PJ - P'!$Y$1:$Y$50,'PJ - P'!$Z$1:$Z$50))","v":""},{"$f":"IF(C14=\"\",\"\",TEST!J11)","v":""},"",null,7,"","","","","","",""]
[null,{"$f":"Start!C14","v":8},{"$f":"IF(Start!D14=\"\",\"\",Start!D14)","v":""},{"$f":"IF($C15=\"\",\"\",IF(V.l.ZPV!$C$6=\"\",\"0\",IF(ISNA(MATCH($C15,ZPVOblN,0)),COUNTIF(ZPVOblT,\".\")+1,LOOKUP($C15,ZPVOblN,ZPVOblD))))","v":""},{"$f":"IF($C15=\"\",\"\",LOOKUP($C15,'DV - P'!$Y$1:$Y$50,'DV - P'!$Z$1:$Z$50))","v":""},{"$f":"IF($C15=\"\",\"\",LOOKUP($C15,'PJ - P'!$Y$1:$Y$50,'PJ - P'!$Z$1:$Z$50))","v":""},{"$f":"IF(C15=\"\",\"\",TEST!J12)","v":""},"",null,8,"","","","","","",""]
[null,{"$f":"Start!C15","v":9},{"$f":"IF(Start!D15=\"\",\"\",Start!D15)","v":""},{"$f":"IF($C16=\"\",\"\",IF(V.l.ZPV!$C$6=\"\",\"0\",IF(ISNA(MATCH($C16,ZPVOblN,0)),COUNTIF(ZPVOblT,\".\")+1,LOOKUP($C16,ZPVOblN,ZPVOblD))))","v":""},{"$f":"IF($C16=\"\",\"\",LOOKUP($C16,'DV - P'!$Y$1:$Y$50,'DV - P'!$Z$1:$Z$50))","v":""},{"$f":"IF($C16=\"\",\"\",LOOKUP($C16,'PJ - P'!$Y$1:$Y$50,'PJ - P'!$Z$1:$Z$50))","v":""},{"$f":"IF(C16=\"\",\"\",TEST!J13)","v":""},"",null,9,"","","","","","",""]
[null,{"$f":"Start!C16","v":10},{"$f":"IF(Start!D16=\"\",\"\",Start!D16)","v":""},{"$f":"IF($C17=\"\",\"\",IF(V.l.ZPV!$C$6=\"\",\"0\",IF(ISNA(MATCH($C17,ZPVOblN,0)),COUNTIF(ZPVOblT,\".\")+1,LOOKUP($C17,ZPVOblN,ZPVOblD))))","v":""},{"$f":"IF($C17=\"\",\"\",LOOKUP($C17,'DV - P'!$Y$1:$Y$50,'DV - P'!$Z$1:$Z$50))","v":""},{"$f":"IF($C17=\"\",\"\",LOOKUP($C17,'PJ - P'!$Y$1:$Y$50,'PJ - P'!$Z$1:$Z$50))","v":""},{"$f":"IF(C17=\"\",\"\",TEST!J14)","v":""},"",null,10,"","","","","","",""]
[null,{"$f":"Start!C17","v":11},{"$f":"IF(Start!D17=\"\",\"\",Start!D17)","v":""},{"$f":"IF($C18=\"\",\"\",IF(V.l.ZPV!$C$6=\"\",\"0\",IF(ISNA(MATCH($C18,ZPVOblN,0)),COUNTIF(ZPVOblT,\".\")+1,LOOKUP($C18,ZPVOblN,ZPVOblD))))","v":""},{"$f":"IF($C18=\"\",\"\",LOOKUP($C18,'DV - P'!$Y$1:$Y$50,'DV - P'!$Z$1:$Z$50))","v":""},{"$f":"IF($C18=\"\",\"\",LOOKUP($C18,'PJ - P'!$Y$1:$Y$50,'PJ - P'!$Z$1:$Z$50))","v":""},{"$f":"IF(C18=\"\",\"\",TEST!J15)","v":""},"",null,11,"","","","","","",""]
[null,{"$f":"Start!C18","v":12},{"$f":"IF(Start!D18=\"\",\"\",Start!D18)","v":""},{"$f":"IF($C19=\"\",\"\",IF(V.l.ZPV!$C$6=\"\",\"0\",IF(ISNA(MATCH($C19,ZPVOblN,0)),COUNTIF(ZPVOblT,\".\")+1,LOOKUP($C19,ZPVOblN,ZPVOblD))))","v":""},{"$f":"IF($C19=\"\",\"\",LOOKUP($C19,'DV - P'!$Y$1:$Y$50,'DV - P'!$Z$1:$Z$50))","v":""},{"$f":"IF($C19=\"\",\"\",LOOKUP($C19,'PJ - P'!$Y$1:$Y$50,'PJ - P'!$Z$1:$Z$50))","v":""},{"$f":"IF(C19=\"\",\"\",TEST!J16)","v":""},"",null,12,"","","","","","",""]
[null,{"$f":"Start!C19","v":13},{"$f":"IF(Start!D19=\"\",\"\",Start!D19)","v":""},{"$f":"IF($C20=\"\",\"\",IF(V.l.ZPV!$C$6=\"\",\"0\",IF(ISNA(MATCH($C20,ZPVOblN,0)),COUNTIF(ZPVOblT,\".\")+1,LOOKUP($C20,ZPVOblN,ZPVOblD))))","v":""},{"$f":"IF($C20=\"\",\"\",LOOKUP($C20,'DV - P'!$Y$1:$Y$50,'DV - P'!$Z$1:$Z$50))","v":""},{"$f":"IF($C20=\"\",\"\",LOOKUP($C20,'PJ - P'!$Y$1:$Y$50,'PJ - P'!$Z$1:$Z$50))","v":""},{"$f":"IF(C20=\"\",\"\",TEST!J17)","v":""},"",null,13,"","","","","","",""]
[null,{"$f":"Start!C20","v":14},{"$f":"IF(Start!D20=\"\",\"\",Start!D20)","v":""},{"$f":"IF($C21=\"\",\"\",IF(V.l.ZPV!$C$6=\"\",\"0\",IF(ISNA(MATCH($C21,ZPVOblN,0)),COUNTIF(ZPVOblT,\".\")+1,LOOKUP($C21,ZPVOblN,ZPVOblD))))","v":""},{"$f":"IF($C21=\"\",\"\",LOOKUP($C21,'DV - P'!$Y$1:$Y$50,'DV - P'!$Z$1:$Z$50))","v":""},{"$f":"IF($C21=\"\",\"\",LOOKUP($C21,'PJ - P'!$Y$1:$Y$50,'PJ - P'!$Z$1:$Z$50))","v":""},{"$f":"IF(C21=\"\",\"\",TEST!J18)","v":""},"",null,14,"","","","","","",""]
[null,{"$f":"Start!C21","v":15},{"$f":"IF(Start!D21=\"\",\"\",Start!D21)","v":""},{"$f":"IF($C22=\"\",\"\",IF(V.l.ZPV!$C$6=\"\",\"0\",IF(ISNA(MATCH($C22,ZPVOblN,0)),COUNTIF(ZPVOblT,\".\")+1,LOOKUP($C22,ZPVOblN,ZPVOblD))))","v":""},{"$f":"IF($C22=\"\",\"\",LOOKUP($C22,'DV - P'!$Y$1:$Y$50,'DV - P'!$Z$1:$Z$50))","v":""},{"$f":"IF($C22=\"\",\"\",LOOKUP($C22,'PJ - P'!$Y$1:$Y$50,'PJ - P'!$Z$1:$Z$50))","v":""},{"$f":"IF(C22=\"\",\"\",TEST!J19)","v":""},"",null,15,"","","","","","",""]
[null,{"$f":"Start!C22","v":16},{"$f":"IF(Start!D22=\"\",\"\",Start!D22)","v":""},{"$f":"IF($C23=\"\",\"\",IF(V.l.ZPV!$C$6=\"\",\"0\",IF(ISNA(MATCH($C23,ZPVOblN,0)),COUNTIF(ZPVOblT,\".\")+1,LOOKUP($C23,ZPVOblN,ZPVOblD))))","v":""},{"$f":"IF($C23=\"\",\"\",LOOKUP($C23,'DV - P'!$Y$1:$Y$50,'DV - P'!$Z$1:$Z$50))","v":""},{"$f":"IF($C23=\"\",\"\",LOOKUP($C23,'PJ - P'!$Y$1:$Y$50,'PJ - P'!$Z$1:$Z$50))","v":""},{"$f":"IF(C23=\"\",\"\",TEST!J20)","v":""},"",null,16,"","","","","","",""]
[null,{"$f":"Start!C23","v":17},{"$f":"IF(Start!D23=\"\",\"\",Start!D23)","v":""},{"$f":"IF($C24=\"\",\"\",IF(V.l.ZPV!$C$6=\"\",\"0\",IF(ISNA(MATCH($C24,ZPVOblN,0)),COUNTIF(ZPVOblT,\".\")+1,LOOKUP($C24,ZPVOblN,ZPVOblD))))","v":""},{"$f":"IF($C24=\"\",\"\",LOOKUP($C24,'DV - P'!$Y$1:$Y$50,'DV - P'!$Z$1:$Z$50))","v":""},{"$f":"IF($C24=\"\",\"\",LOOKUP($C24,'PJ - P'!$Y$1:$Y$50,'PJ - P'!$Z$1:$Z$50))","v":""},{"$f":"IF(C24=\"\",\"\",TEST!J21)","v":""},"",null,17,"","","","","","",""]
[null,{"$f":"Start!C24","v":18},{"$f":"IF(Start!D24=\"\",\"\",Start!D24)","v":""},{"$f":"IF($C25=\"\",\"\",IF(V.l.ZPV!$C$6=\"\",\"0\",IF(ISNA(MATCH($C25,ZPVOblN,0)),COUNTIF(ZPVOblT,\".\")+1,LOOKUP($C25,ZPVOblN,ZPVOblD))))","v":""},{"$f":"IF($C25=\"\",\"\",LOOKUP($C25,'DV - P'!$Y$1:$Y$50,'DV - P'!$Z$1:$Z$50))","v":""},{"$f":"IF($C25=\"\",\"\",LOOKUP($C25,'PJ - P'!$Y$1:$Y$50,'PJ - P'!$Z$1:$Z$50))","v":""},{"$f":"IF(C25=\"\",\"\",TEST!J22)","v":""},"",null,18,"","","","","","",""]
[null,{"$f":"Start!C25","v":19},{"$f":"IF(Start!D25=\"\",\"\",Start!D25)","v":""},{"$f":"IF($C26=\"\",\"\",IF(V.l.ZPV!$C$6=\"\",\"0\",IF(ISNA(MATCH($C26,ZPVOblN,0)),COUNTIF(ZPVOblT,\".\")+1,LOOKUP($C26,ZPVOblN,ZPVOblD))))","v":""},{"$f":"IF($C26=\"\",\"\",LOOKUP($C26,'DV - P'!$Y$1:$Y$50,'DV - P'!$Z$1:$Z$50))","v":""},{"$f":"IF($C26=\"\",\"\",LOOKUP($C26,'PJ - P'!$Y$1:$Y$50,'PJ - P'!$Z$1:$Z$50))","v":""},{"$f":"IF(C26=\"\",\"\",TEST!J23)","v":""},"",null,19,"","","","","","",""]
[null,{"$f":"Start!C26","v":20},{"$f":"IF(Start!D26=\"\",\"\",Start!D26)","v":""},{"$f":"IF($C27=\"\",\"\",IF(V.l.ZPV!$C$6=\"\",\"0\",IF(ISNA(MATCH($C27,ZPVOblN,0)),COUNTIF(ZPVOblT,\".\")+1,LOOKUP($C27,ZPVOblN,ZPVOblD))))","v":""},{"$f":"IF($C27=\"\",\"\",LOOKUP($C27,'DV - P'!$Y$1:$Y$50,'DV - P'!$Z$1:$Z$50))","v":""},{"$f":"IF($C27=\"\",\"\",LOOKUP($C27,'PJ - P'!$Y$1:$Y$50,'PJ - P'!$Z$1:$Z$50))","v":""},{"$f":"IF(C27=\"\",\"\",TEST!J24)","v":""},"",null,20,"","","","","","",""]
[null,{"$f":"Start!C27","v":21},{"$f":"IF(Start!D27=\"\",\"\",Start!D27)","v":""},{"$f":"IF($C28=\"\",\"\",IF(V.l.ZPV!$C$6=\"\",\"0\",IF(ISNA(MATCH($C28,ZPVOblN,0)),COUNTIF(ZPVOblT,\".\")+1,LOOKUP($C28,ZPVOblN,ZPVOblD))))","v":""},{"$f":"IF($C28=\"\",\"\",LOOKUP($C28,'DV - P'!$Y$1:$Y$50,'DV - P'!$Z$1:$Z$50))","v":""},{"$f":"IF($C28=\"\",\"\",LOOKUP($C28,'PJ - P'!$Y$1:$Y$50,'PJ - P'!$Z$1:$Z$50))","v":""},{"$f":"IF(C28=\"\",\"\",TEST!J25)","v":""},"",null,21,"","","","","","",""]
[null,{"$f":"Start!C28","v":22},{"$f":"IF(Start!D28=\"\",\"\",Start!D28)","v":""},{"$f":"IF($C29=\"\",\"\",IF(V.l.ZPV!$C$6=\"\",\"0\",IF(ISNA(MATCH($C29,ZPVOblN,0)),COUNTIF(ZPVOblT,\".\")+1,LOOKUP($C29,ZPVOblN,ZPVOblD))))","v":""},{"$f":"IF($C29=\"\",\"\",LOOKUP($C29,'DV - P'!$Y$1:$Y$50,'DV - P'!$Z$1:$Z$50))","v":""},{"$f":"IF($C29=\"\",\"\",LOOKUP($C29,'PJ - P'!$Y$1:$Y$50,'PJ - P'!$Z$1:$Z$50))","v":""},{"$f":"IF(C29=\"\",\"\",TEST!J26)","v":""},"",null,22,"","","","","","",""]
[null,{"$f":"Start!C29","v":23},{"$f":"IF(Start!D29=\"\",\"\",Start!D29)","v":""},{"$f":"IF($C30=\"\",\"\",IF(V.l.ZPV!$C$6=\"\",\"0\",IF(ISNA(MATCH($C30,ZPVOblN,0)),COUNTIF(ZPVOblT,\".\")+1,LOOKUP($C30,ZPVOblN,ZPVOblD))))","v":""},{"$f":"IF($C30=\"\",\"\",LOOKUP($C30,'DV - P'!$Y$1:$Y$50,'DV - P'!$Z$1:$Z$50))","v":""},{"$f":"IF($C30=\"\",\"\",LOOKUP($C30,'PJ - P'!$Y$1:$Y$50,'PJ - P'!$Z$1:$Z$50))","v":""},{"$f":"IF(C30=\"\",\"\",TEST!J27)","v":""},"",null,23,"","","","","","",0]
[null,{"$f":"Start!C30","v":24},{"$f":"IF(Start!D30=\"\",\"\",Start!D30)","v":""},{"$f":"IF($C31=\"\",\"\",IF(V.l.ZPV!$C$6=\"\",\"0\",IF(ISNA(MATCH($C31,ZPVOblN,0)),COUNTIF(ZPVOblT,\".\")+1,LOOKUP($C31,ZPVOblN,ZPVOblD))))","v":""},{"$f":"IF($C31=\"\",\"\",LOOKUP($C31,'DV - P'!$Y$1:$Y$50,'DV - P'!$Z$1:$Z$50))","v":""},{"$f":"IF($C31=\"\",\"\",LOOKUP($C31,'PJ - P'!$Y$1:$Y$50,'PJ - P'!$Z$1:$Z$50))","v":""},{"$f":"IF(C31=\"\",\"\",TEST!J28)","v":""},"",null,24,"","","","","","",0]
[null,{"$f":"Start!C31","v":25},{"$f":"IF(Start!D31=\"\",\"\",Start!D31)","v":""},{"$f":"IF($C32=\"\",\"\",IF(V.l.ZPV!$C$6=\"\",\"0\",IF(ISNA(MATCH($C32,ZPVOblN,0)),COUNTIF(ZPVOblT,\".\")+1,LOOKUP($C32,ZPVOblN,ZPVOblD))))","v":""},{"$f":"IF($C32=\"\",\"\",LOOKUP($C32,'DV - P'!$Y$1:$Y$50,'DV - P'!$Z$1:$Z$50))","v":""},{"$f":"IF($C32=\"\",\"\",LOOKUP($C32,'PJ - P'!$Y$1:$Y$50,'PJ - P'!$Z$1:$Z$50))","v":""},{"$f":"IF(C32=\"\",\"\",TEST!J29)","v":""},"",null,25,"","","","","","",0]
[null,{"$f":"Start!C32","v":26},{"$f":"IF(Start!D32=\"\",\"\",Start!D32)","v":""},{"$f":"IF($C33=\"\",\"\",IF(V.l.ZPV!$C$6=\"\",\"0\",IF(ISNA(MATCH($C33,ZPVOblN,0)),COUNTIF(ZPVOblT,\".\")+1,LOOKUP($C33,ZPVOblN,ZPVOblD))))","v":""},{"$f":"IF($C33=\"\",\"\",LOOKUP($C33,'DV - P'!$Y$1:$Y$50,'DV - P'!$Z$1:$Z$50))","v":""},{"$f":"IF($C33=\"\",\"\",LOOKUP($C33,'PJ - P'!$Y$1:$Y$50,'PJ - P'!$Z$1:$Z$50))","v":""},{"$f":"IF(C33=\"\",\"\",TEST!J30)","v":""},"",null,26,"","","","","","",0]
[null,{"$f":"Start!C33","v":27},{"$f":"IF(Start!D33=\"\",\"\",Start!D33)","v":""},{"$f":"IF($C34=\"\",\"\",IF(V.l.ZPV!$C$6=\"\",\"0\",IF(ISNA(MATCH($C34,ZPVOblN,0)),COUNTIF(ZPVOblT,\".\")+1,LOOKUP($C34,ZPVOblN,ZPVOblD))))","v":""},{"$f":"IF($C34=\"\",\"\",LOOKUP($C34,'DV - P'!$Y$1:$Y$50,'DV - P'!$Z$1:$Z$50))","v":""},{"$f":"IF($C34=\"\",\"\",LOOKUP($C34,'PJ - P'!$Y$1:$Y$50,'PJ - P'!$Z$1:$Z$50))","v":""},{"$f":"IF(C34=\"\",\"\",TEST!J31)","v":""},"",null,27,"","","","","","",""]
[null,{"$f":"Start!C34","v":28},{"$f":"IF(Start!D34=\"\",\"\",Start!D34)","v":""},{"$f":"IF($C35=\"\",\"\",IF(V.l.ZPV!$C$6=\"\",\"0\",IF(ISNA(MATCH($C35,ZPVOblN,0)),COUNTIF(ZPVOblT,\".\")+1,LOOKUP($C35,ZPVOblN,ZPVOblD))))","v":""},{"$f":"IF($C35=\"\",\"\",LOOKUP($C35,'DV - P'!$Y$1:$Y$50,'DV - P'!$Z$1:$Z$50))","v":""},{"$f":"IF($C35=\"\",\"\",LOOKUP($C35,'PJ - P'!$Y$1:$Y$50,'PJ - P'!$Z$1:$Z$50))","v":""},{"$f":"IF(C35=\"\",\"\",TEST!J32)","v":""},"",null,28,"","","","","","",""]
[null,{"$f":"Start!C35","v":29},{"$f":"IF(Start!D35=\"\",\"\",Start!D35)","v":""},{"$f":"IF($C36=\"\",\"\",IF(V.l.ZPV!$C$6=\"\",\"0\",IF(ISNA(MATCH($C36,ZPVOblN,0)),COUNTIF(ZPVOblT,\".\")+1,LOOKUP($C36,ZPVOblN,ZPVOblD))))","v":""},{"$f":"IF($C36=\"\",\"\",LOOKUP($C36,'DV - P'!$Y$1:$Y$50,'DV - P'!$Z$1:$Z$50))","v":""},{"$f":"IF($C36=\"\",\"\",LOOKUP($C36,'PJ - P'!$Y$1:$Y$50,'PJ - P'!$Z$1:$Z$50))","v":""},{"$f":"IF(C36=\"\",\"\",TEST!J33)","v":""},"",null,29,"","","","","","",""]
[null,{"$f":"Start!C36","v":30},{"$f":"IF(Start!D36=\"\",\"\",Start!D36)","v":""},{"$f":"IF($C37=\"\",\"\",IF(V.l.ZPV!$C$6=\"\",\"0\",IF(ISNA(MATCH($C37,ZPVOblN,0)),COUNTIF(ZPVOblT,\".\")+1,LOOKUP($C37,ZPVOblN,ZPVOblD))))","v":""},{"$f":"IF($C37=\"\",\"\",LOOKUP($C37,'DV - P'!$Y$1:$Y$50,'DV - P'!$Z$1:$Z$50))","v":""},{"$f":"IF($C37=\"\",\"\",LOOKUP($C37,'PJ - P'!$Y$1:$Y$50,'PJ - P'!$Z$1:$Z$50))","v":""},{"$f":"IF(C37=\"\",\"\",TEST!J34)","v":""},"",null,30,"","","","","","",""]
[null,{"$f":"Start!C37","v":31},{"$f":"IF(Start!D37=\"\",\"\",Start!D37)","v":""},{"$f":"IF($C38=\"\",\"\",IF(V.l.ZPV!$C$6=\"\",\"0\",IF(ISNA(MATCH($C38,ZPVOblN,0)),COUNTIF(ZPVOblT,\".\")+1,LOOKUP($C38,ZPVOblN,ZPVOblD))))","v":""},{"$f":"IF($C38=\"\",\"\",LOOKUP($C38,'DV - P'!$Y$1:$Y$50,'DV - P'!$Z$1:$Z$50))","v":""},{"$f":"IF($C38=\"\",\"\",LOOKUP($C38,'PJ - P'!$Y$1:$Y$50,'PJ - P'!$Z$1:$Z$50))","v":""},{"$f":"IF(C38=\"\",\"\",TEST!J35)","v":""},"",null,31,"","","","","","",""]
[null,{"$f":"Start!C38","v":32},{"$f":"IF(Start!D38=\"\",\"\",Start!D38)","v":""},{"$f":"IF($C39=\"\",\"\",IF(V.l.ZPV!$C$6=\"\",\"0\",IF(ISNA(MATCH($C39,ZPVOblN,0)),COUNTIF(ZPVOblT,\".\")+1,LOOKUP($C39,ZPVOblN,ZPVOblD))))","v":""},{"$f":"IF($C39=\"\",\"\",LOOKUP($C39,'DV - P'!$Y$1:$Y$50,'DV - P'!$Z$1:$Z$50))","v":""},{"$f":"IF($C39=\"\",\"\",LOOKUP($C39,'PJ - P'!$Y$1:$Y$50,'PJ - P'!$Z$1:$Z$50))","v":""},{"$f":"IF(C39=\"\",\"\",TEST!J36)","v":""},"",null,32,"","","","","","",""]
[null,{"$f":"Start!C39","v":33},{"$f":"IF(Start!D39=\"\",\"\",Start!D39)","v":""},{"$f":"IF($C40=\"\",\"\",IF(V.l.ZPV!$C$6=\"\",\"0\",IF(ISNA(MATCH($C40,ZPVOblN,0)),COUNTIF(ZPVOblT,\".\")+1,LOOKUP($C40,ZPVOblN,ZPVOblD))))","v":""},{"$f":"IF($C40=\"\",\"\",LOOKUP($C40,'DV - P'!$Y$1:$Y$50,'DV - P'!$Z$1:$Z$50))","v":""},{"$f":"IF($C40=\"\",\"\",LOOKUP($C40,'PJ - P'!$Y$1:$Y$50,'PJ - P'!$Z$1:$Z$50))","v":""},{"$f":"IF(C40=\"\",\"\",TEST!J37)","v":""},"",null,33,"","","","","","",""]
[null,{"$f":"Start!C40","v":34},{"$f":"IF(Start!D40=\"\",\"\",Start!D40)","v":""},{"$f":"IF($C41=\"\",\"\",IF(V.l.ZPV!$C$6=\"\",\"0\",IF(ISNA(MATCH($C41,ZPVOblN,0)),COUNTIF(ZPVOblT,\".\")+1,LOOKUP($C41,ZPVOblN,ZPVOblD))))","v":""},{"$f":"IF($C41=\"\",\"\",LOOKUP($C41,'DV - P'!$Y$1:$Y$50,'DV - P'!$Z$1:$Z$50))","v":""},{"$f":"IF($C41=\"\",\"\",LOOKUP($C41,'PJ - P'!$Y$1:$Y$50,'PJ - P'!$Z$1:$Z$50))","v":""},{"$f":"IF(C41=\"\",\"\",TEST!J38)","v":""},"",null,34,"","","","","","",""]
[null,{"$f":"Start!C41","v":35},{"$f":"IF(Start!D41=\"\",\"\",Start!D41)","v":""},{"$f":"IF($C42=\"\",\"\",IF(V.l.ZPV!$C$6=\"\",\"0\",IF(ISNA(MATCH($C42,ZPVOblN,0)),COUNTIF(ZPVOblT,\".\")+1,LOOKUP($C42,ZPVOblN,ZPVOblD))))","v":""},{"$f":"IF($C42=\"\",\"\",LOOKUP($C42,'DV - P'!$Y$1:$Y$50,'DV - P'!$Z$1:$Z$50))","v":""},{"$f":"IF($C42=\"\",\"\",LOOKUP($C42,'PJ - P'!$Y$1:$Y$50,'PJ - P'!$Z$1:$Z$50))","v":""},{"$f":"IF(C42=\"\",\"\",TEST!J39)","v":""},"",null,35,"","","","","","",""]
[null,{"$f":"Start!C42","v":36},{"$f":"IF(Start!D42=\"\",\"\",Start!D42)","v":""},{"$f":"IF($C43=\"\",\"\",IF(V.l.ZPV!$C$6=\"\",\"0\",IF(ISNA(MATCH($C43,ZPVOblN,0)),COUNTIF(ZPVOblT,\".\")+1,LOOKUP($C43,ZPVOblN,ZPVOblD))))","v":""},{"$f":"IF($C43=\"\",\"\",LOOKUP($C43,'DV - P'!$Y$1:$Y$50,'DV - P'!$Z$1:$Z$50))","v":""},{"$f":"IF($C43=\"\",\"\",LOOKUP($C43,'PJ - P'!$Y$1:$Y$50,'PJ - P'!$Z$1:$Z$50))","v":""},{"$f":"IF(C43=\"\",\"\",TEST!J40)","v":""},"",null,36,"","","","","","",""]
[null,{"$f":"Start!C43","v":37},{"$f":"IF(Start!D43=\"\",\"\",Start!D43)","v":""},{"$f":"IF($C44=\"\",\"\",IF(V.l.ZPV!$C$6=\"\",\"0\",IF(ISNA(MATCH($C44,ZPVOblN,0)),COUNTIF(ZPVOblT,\".\")+1,LOOKUP($C44,ZPVOblN,ZPVOblD))))","v":""},{"$f":"IF($C44=\"\",\"\",LOOKUP($C44,'DV - P'!$Y$1:$Y$50,'DV - P'!$Z$1:$Z$50))","v":""},{"$f":"IF($C44=\"\",\"\",LOOKUP($C44,'PJ - P'!$Y$1:$Y$50,'PJ - P'!$Z$1:$Z$50))","v":""},{"$f":"IF(C44=\"\",\"\",TEST!J41)","v":""},"",null,37,"","","","","","",""]
[null,{"$f":"Start!C44","v":38},{"$f":"IF(Start!D44=\"\",\"\",Start!D44)","v":""},{"$f":"IF($C45=\"\",\"\",IF(V.l.ZPV!$C$6=\"\",\"0\",IF(ISNA(MATCH($C45,ZPVOblN,0)),COUNTIF(ZPVOblT,\".\")+1,LOOKUP($C45,ZPVOblN,ZPVOblD))))","v":""},{"$f":"IF($C45=\"\",\"\",LOOKUP($C45,'DV - P'!$Y$1:$Y$50,'DV - P'!$Z$1:$Z$50))","v":""},{"$f":"IF($C45=\"\",\"\",LOOKUP($C45,'PJ - P'!$Y$1:$Y$50,'PJ - P'!$Z$1:$Z$50))","v":""},{"$f":"IF(C45=\"\",\"\",TEST!J42)","v":""},"",null,38,"","","","","","",""]
[null,{"$f":"Start!C45","v":39},{"$f":"IF(Start!D45=\"\",\"\",Start!D45)","v":""},{"$f":"IF($C46=\"\",\"\",IF(V.l.ZPV!$C$6=\"\",\"0\",IF(ISNA(MATCH($C46,ZPVOblN,0)),COUNTIF(ZPVOblT,\".\")+1,LOOKUP($C46,ZPVOblN,ZPVOblD))))","v":""},{"$f":"IF($C46=\"\",\"\",LOOKUP($C46,'DV - P'!$Y$1:$Y$50,'DV - P'!$Z$1:$Z$50))","v":""},{"$f":"IF($C46=\"\",\"\",LOOKUP($C46,'PJ - P'!$Y$1:$Y$50,'PJ - P'!$Z$1:$Z$50))","v":""},{"$f":"IF(C46=\"\",\"\",TEST!J43)","v":""},"",null,39,"","","","","","",0]
[null,{"$f":"Start!C46","v":40},{"$f":"IF(Start!D46=\"\",\"\",Start!D46)","v":""},{"$f":"IF($C47=\"\",\"\",IF(V.l.ZPV!$C$6=\"\",\"0\",IF(ISNA(MATCH($C47,ZPVOblN,0)),COUNTIF(ZPVOblT,\".\")+1,LOOKUP($C47,ZPVOblN,ZPVOblD))))","v":""},{"$f":"IF($C47=\"\",\"\",LOOKUP($C47,'DV - P'!$Y$1:$Y$50,'DV - P'!$Z$1:$Z$50))","v":""},{"$f":"IF($C47=\"\",\"\",LOOKUP($C47,'PJ - P'!$Y$1:$Y$50,'PJ - P'!$Z$1:$Z$50))","v":""},{"$f":"IF(C47=\"\",\"\",TEST!J44)","v":""},"",null,40,"","","","","","",0]
[null,{"$f":"Start!C47","v":41},{"$f":"IF(Start!D47=\"\",\"\",Start!D47)","v":""},{"$f":"IF($C48=\"\",\"\",IF(V.l.ZPV!$C$6=\"\",\"0\",IF(ISNA(MATCH($C48,ZPVOblN,0)),COUNTIF(ZPVOblT,\".\")+1,LOOKUP($C48,ZPVOblN,ZPVOblD))))","v":""},{"$f":"IF($C48=\"\",\"\",LOOKUP($C48,'DV - P'!$Y$1:$Y$50,'DV - P'!$Z$1:$Z$50))","v":""},{"$f":"IF($C48=\"\",\"\",LOOKUP($C48,'PJ - P'!$Y$1:$Y$50,'PJ - P'!$Z$1:$Z$50))","v":""},{"$f":"IF(C48=\"\",\"\",TEST!J45)","v":""},"",null,41,"","","","","","",0]
[null,{"$f":"Start!C48","v":42},{"$f":"IF(Start!D48=\"\",\"\",Start!D48)","v":""},{"$f":"IF($C49=\"\",\"\",IF(V.l.ZPV!$C$6=\"\",\"0\",IF(ISNA(MATCH($C49,ZPVOblN,0)),COUNTIF(ZPVOblT,\".\")+1,LOOKUP($C49,ZPVOblN,ZPVOblD))))","v":""},{"$f":"IF($C49=\"\",\"\",LOOKUP($C49,'DV - P'!$Y$1:$Y$50,'DV - P'!$Z$1:$Z$50))","v":""},{"$f":"IF($C49=\"\",\"\",LOOKUP($C49,'PJ - P'!$Y$1:$Y$50,'PJ - P'!$Z$1:$Z$50))","v":""},{"$f":"IF(C49=\"\",\"\",TEST!J46)","v":""},"",null,42,"","","","","","",0]
[null,{"$f":"Start!C49","v":43},{"$f":"IF(Start!D49=\"\",\"\",Start!D49)","v":""},{"$f":"IF($C50=\"\",\"\",IF(V.l.ZPV!$C$6=\"\",\"0\",IF(ISNA(MATCH($C50,ZPVOblN,0)),COUNTIF(ZPVOblT,\".\")+1,LOOKUP($C50,ZPVOblN,ZPVOblD))))","v":""},{"$f":"IF($C50=\"\",\"\",LOOKUP($C50,'DV - P'!$Y$1:$Y$50,'DV - P'!$Z$1:$Z$50))","v":""},{"$f":"IF($C50=\"\",\"\",LOOKUP($C50,'PJ - P'!$Y$1:$Y$50,'PJ - P'!$Z$1:$Z$50))","v":""},{"$f":"IF(C50=\"\",\"\",TEST!J47)","v":""},"",null,43,"","","","","","",""]
[null,{"$f":"Start!C50","v":44},{"$f":"IF(Start!D50=\"\",\"\",Start!D50)","v":""},{"$f":"IF($C51=\"\",\"\",IF(V.l.ZPV!$C$6=\"\",\"0\",IF(ISNA(MATCH($C51,ZPVOblN,0)),COUNTIF(ZPVOblT,\".\")+1,LOOKUP($C51,ZPVOblN,ZPVOblD))))","v":""},{"$f":"IF($C51=\"\",\"\",LOOKUP($C51,'DV - P'!$Y$1:$Y$50,'DV - P'!$Z$1:$Z$50))","v":""},{"$f":"IF($C51=\"\",\"\",LOOKUP($C51,'PJ - P'!$Y$1:$Y$50,'PJ - P'!$Z$1:$Z$50))","v":""},{"$f":"IF(C51=\"\",\"\",TEST!J48)","v":""},"",null,44,"","","","","","",""]
[null,{"$f":"Start!C51","v":45},{"$f":"IF(Start!D51=\"\",\"\",Start!D51)","v":""},{"$f":"IF($C52=\"\",\"\",IF(V.l.ZPV!$C$6=\"\",\"0\",IF(ISNA(MATCH($C52,ZPVOblN,0)),COUNTIF(ZPVOblT,\".\")+1,LOOKUP($C52,ZPVOblN,ZPVOblD))))","v":""},{"$f":"IF($C52=\"\",\"\",LOOKUP($C52,'DV - P'!$Y$1:$Y$50,'DV - P'!$Z$1:$Z$50))","v":""},{"$f":"IF($C52=\"\",\"\",LOOKUP($C52,'PJ - P'!$Y$1:$Y$50,'PJ - P'!$Z$1:$Z$50))","v":""},{"$f":"IF(C52=\"\",\"\",TEST!J49)","v":""},"",null,45,"","","","","","",""]
[null,{"$f":"Start!C52","v":46},{"$f":"IF(Start!D52=\"\",\"\",Start!D52)","v":""},{"$f":"IF($C53=\"\",\"\",IF(V.l.ZPV!$C$6=\"\",\"0\",IF(ISNA(MATCH($C53,ZPVOblN,0)),COUNTIF(ZPVOblT,\".\")+1,LOOKUP($C53,ZPVOblN,ZPVOblD))))","v":""},{"$f":"IF($C53=\"\",\"\",LOOKUP($C53,'DV - P'!$Y$1:$Y$50,'DV - P'!$Z$1:$Z$50))","v":""},{"$f":"IF($C53=\"\",\"\",LOOKUP($C53,'PJ - P'!$Y$1:$Y$50,'PJ - P'!$Z$1:$Z$50))","v":""},{"$f":"IF(C53=\"\",\"\",TEST!J50)","v":""},"",null,46,"","","","","","",""]
[null,{"$f":"Start!C53","v":47},{"$f":"IF(Start!D53=\"\",\"\",Start!D53)","v":""},{"$f":"IF($C54=\"\",\"\",IF(V.l.ZPV!$C$6=\"\",\"0\",IF(ISNA(MATCH($C54,ZPVOblN,0)),COUNTIF(ZPVOblT,\".\")+1,LOOKUP($C54,ZPVOblN,ZPVOblD))))","v":""},{"$f":"IF($C54=\"\",\"\",LOOKUP($C54,'DV - P'!$Y$1:$Y$50,'DV - P'!$Z$1:$Z$50))","v":""},{"$f":"IF($C54=\"\",\"\",LOOKUP($C54,'PJ - P'!$Y$1:$Y$50,'PJ - P'!$Z$1:$Z$50))","v":""},{"$f":"IF(C54=\"\",\"\",TEST!J51)","v":""},"",null,47,"","","","","","",""]
[null,{"$f":"Start!C54","v":48},{"$f":"IF(Start!D54=\"\",\"\",Start!D54)","v":""},{"$f":"IF($C55=\"\",\"\",IF(V.l.ZPV!$C$6=\"\",\"0\",IF(ISNA(MATCH($C55,ZPVOblN,0)),COUNTIF(ZPVOblT,\".\")+1,LOOKUP($C55,ZPVOblN,ZPVOblD))))","v":""},{"$f":"IF($C55=\"\",\"\",LOOKUP($C55,'DV - P'!$Y$1:$Y$50,'DV - P'!$Z$1:$Z$50))","v":""},{"$f":"IF($C55=\"\",\"\",LOOKUP($C55,'PJ - P'!$Y$1:$Y$50,'PJ - P'!$Z$1:$Z$50))","v":""},{"$f":"IF(C55=\"\",\"\",TEST!J52)","v":""},"",null,48,"","","","","","",""]
[null,{"$f":"Start!C55","v":49},{"$f":"IF(Start!D55=\"\",\"\",Start!D55)","v":""},{"$f":"IF($C56=\"\",\"\",IF(V.l.ZPV!$C$6=\"\",\"0\",IF(ISNA(MATCH($C56,ZPVOblN,0)),COUNTIF(ZPVOblT,\".\")+1,LOOKUP($C56,ZPVOblN,ZPVOblD))))","v":""},{"$f":"IF($C56=\"\",\"\",LOOKUP($C56,'DV - P'!$Y$1:$Y$50,'DV - P'!$Z$1:$Z$50))","v":""},{"$f":"IF($C56=\"\",\"\",LOOKUP($C56,'PJ - P'!$Y$1:$Y$50,'PJ - P'!$Z$1:$Z$50))","v":""},{"$f":"IF(C56=\"\",\"\",TEST!J53)","v":""},"",null,49,"","","","","","",""]
[null,{"$f":"Start!C56","v":50},{"$f":"IF(Start!D56=\"\",\"\",Start!D56)","v":""},{"$f":"IF($C57=\"\",\"\",IF(V.l.ZPV!$C$6=\"\",\"0\",IF(ISNA(MATCH($C57,ZPVOblN,0)),COUNTIF(ZPVOblT,\".\")+1,LOOKUP($C57,ZPVOblN,ZPVOblD))))","v":""},{"$f":"IF($C57=\"\",\"\",LOOKUP($C57,'DV - P'!$Y$1:$Y$50,'DV - P'!$Z$1:$Z$50))","v":""},{"$f":"IF($C57=\"\",\"\",LOOKUP($C57,'PJ - P'!$Y$1:$Y$50,'PJ - P'!$Z$1:$Z$50))","v":""},{"$f":"IF(C57=\"\",\"\",TEST!J54)","v":""},"",null,50,"","","","","","",""]

{"sheet":"Tisk-v1","index":15,"n_rows":113,"n_cols":20,"rows_kept":113,"cut":false,"hidden":false,"merged":[[88,1,112,1],[62,11,87,11],[88,11,112,11],[59,2,59,18],[60,2,60,7],[60,12,60,17],[62,1,87,1],[0,1,0,19],[3,2,3,7],[3,12,3,17],[57,1,57,19],[2,2,2,18],[5,1,30,1],[31,1,55,1],[5,11,30,11],[31,11,55,11]]}
[null,"Tisková sestava"]
[]
[null,null,{"$f":"Start!$B$2","v":"Krajské kolo soutěží dorostu"}]
[null,null,{"$f":"\"Kategorie: \"&Start!$D$5","v":"Kategorie: Dorky - Střední"},null,null,null,null,null,null,null,null,null,{"$f":"Start!$B$3","v":"19. června 2021 Tachov"}]
[]
[null,"Běh na 100m s překážkami","st.č.","Jméno",{"$f":"Start!$F$6","v":"Okres"},"1.pokus","2.pokus","čas",null,"Poř.",null,"Dvojboj","st.č.","Jméno",{"$f":"Start!$F$6","v":"Okres"},"1.pokus","2.pokus","čas",null,"Poř."]
[null,null,{"$f":"Start!C7","v":1},{"$f":"IF(Start!D7=\"\",\"\",Start!D7)","v":"Klára Trmotová"},{"$f":"IF(Start!F7=\"\",\"\",Start!F7)","v":"KT"},{"$f":"IF(D7=\"\",\"\",'PJ-V'!$J5)","v":33.979999999999997},{"$f":"IF(D7=\"\",\"\",'PJ-V'!$O5)","v":20.440000000000001},{"$f":"IF(D7=\"\",\"\",'PJ-V'!$Q5)","v":20.440000000000001},null,{"$f":"IF(D7=\"\",\"\",Výsledky!$F8)","v":2},null,null,{"$f":"Start!C7","v":1},{"$f":"IF(Start!D7=\"\",\"\",Start!D7)","v":"Klára Trmotová"},{"$f":"IF(Start!F7=\"\",\"\",Start!F7)","v":"KT"},{"$f":"IF(N7=\"\",\"\",'DV-V'!$J5)","v":"DNF"},{"$f":"IF(N7=\"\",\"\",'DV-V'!$O5)","v":"DNF"},{"$f":"IF(N7=\"\",\"\",'DV-V'!$Q5)","v":"DNF"},null,{"$f":"IF(N7=\"\",\"\",Výsledky!$E8)","v":1}]
[null,null,{"$f":"Start!C8","v":2},{"$f":"IF(Start!D8=\"\",\"\",Start!D8)","v":"Tereza Grünerová "},{"$f":"IF(Start!F8=\"\",\"\",Start!F8)","v":"TA"},{"$f":"IF(D8=\"\",\"\",'PJ-V'!$J6)","v":32.08},{"$f":"IF(D8=\"\",\"\",'PJ-V'!$O6)","v":"NP"},{"$f":"IF(D8=\"\",\"\",'PJ-V'!$Q6)","v":32.08},null,{"$f":"IF(D8=\"\",\"\",Výsledky!$F9)","v":5},null,null,{"$f":"Start!C8","v":2},{"$f":"IF(Start!D8=\"\",\"\",Start!D8)","v":"Tereza Grünerová "},{"$f":"IF(Start!F8=\"\",\"\",Start!F8)","v":"TA"},{"$f":"IF(N8=\"\",\"\",'DV-V'!$J6)","v":"DNF"},{"$f":"IF(N8=\"\",\"\",'DV-V'!$O6)","v":"DNF"},{"$f":"IF(N8=\"\",\"\",'DV-V'!$Q6)","v":"DNF"},null,{"$f":"IF(N8=\"\",\"\",Výsledky!$E9)","v":1}]
[null,null,{"$f":"Start!C9","v":3},{"$f":"IF(Start!D9=\"\",\"\",Start!D9)","v":"Iva Babková"},{"$f":"IF(Start!F9=\"\",\"\",Start!F9)","v":"KT"},{"$f":"IF(D9=\"\",\"\",'PJ-V'!$J7)","v":22.33},{"$f":"IF(D9=\"\",\"\",'PJ-V'!$O7)","v":19.28},{"$f":"IF(D9=\"\",\"\",'PJ-V'!$Q7)","v":19.28},null,{"$f":"IF(D9=\"\",\"\",Výsledky!$F10)","v":1},null,null,{"$f":"Start!C9","v":3},{"$f":"IF(Start!D9=\"\",\"\",Start!D9)","v":"Iva Babková"},{"$f":"IF(Start!F9=\"\",\"\",Start!F9)","v":"KT"},{"$f":"IF(N9=\"\",\"\",'DV-V'!$J7)","v":"DNF"},{"$f":"IF(N9=\"\",\"\",'DV-V'!$O7)","v":"DNF"},{"$f":"IF(N9=\"\",\"\",'DV-V'!$Q7)","v":"DNF"},null,{"$f":"IF(N9=\"\",\"\",Výsledky!$E10)","v":1}]
[null,null,{"$f":"Start!C10","v":4},{"$f":"IF(Start!D10=\"\",\"\",Start!D10)","v":"Michaela Marešová"},{"$f":"IF(Start!F10=\"\",\"\",Start!F10)","v":"TA"},{"$f":"IF(D10=\"\",\"\",'PJ-V'!$J8)","v":30.94},{"$f":"IF(D10=\"\",\"\",'PJ-V'!$O8)","v":23.66},{"$f":"IF(D10=\"\",\"\",'PJ-V'!$Q8)","v":23.66},null,{"$f":"IF(D10=\"\",\"\",Výsledky!$F11)","v":3},null,null,{"$f":"Start!C10","v":4},{"$f":"IF(Start!D10=\"\",\"\",Start!D10)","v":"Michaela Marešová"},{"$f":"IF(Start!F10=\"\",\"\",Start!F10)","v":"TA"},{"$f":"IF(N10=\"\",\"\",'DV-V'!$J8)","v":"DNF"},{"$f":"IF(N10=\"\",\"\",'DV-V'!$O8)","v":"DNF"},{"$f":"IF(N10=\"\",\"\",'DV-V'!$Q8)","v":"DNF"},null,{"$f":"IF(N10=\"\",\"\",Výsledky!$E11)","v":1}]
[null,null,{"$f":"Start!C11","v":5},{"$f":"IF(Start!D11=\"\",\"\",Start!D11)","v":"Adéla Stodolová"},{"$f":"IF(Start!F11=\"\",\"\",Start!F11)","v":"TA"},{"$f":"IF(D11=\"\",\"\",'PJ-V'!$J9)","v":29.29},{"$f":"IF(D11=\"\",\"\",'PJ-V'!$O9)","v":31.11},{"$f":"IF(D11=\"\",\"\",'PJ-V'!$Q9)","v":29.29},null,{"$f":"IF(D11=\"\",\"\",Výsledky!$F12)","v":4},null,null,{"$f":"Start!C11","v":5},{"$f":"IF(Start!D11=\"\",\"\",Start!D11)","v":"Adéla Stodolová"},{"$f":"IF(Start!F11=\"\",\"\",Start!F11)","v":"TA"},{"$f":"IF(N11=\"\",\"\",'DV-V'!$J9)","v":"DNF"},{"$f":"IF(N11=\"\",\"\",'DV-V'!$O9)","v":"DNF"},{"$f":"IF(N11=\"\",\"\",'DV-V'!$Q9)","v":"DNF"},null,{"$f":"IF(N11=\"\",\"\",Výsledky!$E12)","v":1}]
[null,null,{"$f":"Start!C12","v":6},{"$f":"IF(Start!D12=\"\",\"\",Start!D12)","v":""},{"$f":"IF(Start!F12=\"\",\"\",Start!F12)","v":""},{"$f":"IF(D12=\"\",\"\",'PJ-V'!$J10)","v":""},{"$f":"IF(D12=\"\",\"\",'PJ-V'!$O10)","v":""},{"$f":"IF(D12=\"\",\"\",'PJ-V'!$Q10)","v":""},null,{"$f":"IF(D12=\"\",\"\",Výsledky!$F13)","v":""},null,null,{"$f":"Start!C12","v":6},{"$f":"IF(Start!D12=\"\",\"\",Start!D12)","v":""},{"$f":"IF(Start!F12=\"\",\"\",Start!F12)","v":""},{"$f":"IF(N12=\"\",\"\",'DV-V'!$J10)","v":""},{"$f":"IF(N12=\"\",\"\",'DV-V'!$O10)","v":""},{"$f":"IF(N12=\"\",\"\",'DV-V'!$Q10)","v":""},null,{"$f":"IF(N12=\"\",\"\",Výsledky!$E13)","v":""}]
[null,null,{"$f":"Start!C13","v":7},{"$f":"IF(Start!D13=\"\",\"\",Start!D13)","v":""},{"$f":"IF(Start!F13=\"\",\"\",Start!F13)","v":""},{"$f":"IF(D13=\"\",\"\",'PJ-V'!$J11)","v":""},{"$f":"IF(D13=\"\",\"\",'PJ-V'!$O11)","v":""},{"$f":"IF(D13=\"\",\"\",'PJ-V'!$Q11)","v":""},null,{"$f":"IF(D13=\"\",\"\",Výsledky!$F14)","v":""},null,null,{"$f":"Start!C13","v":7},{"$f":"IF(Start!D13=\"\",\"\",Start!D13)","v":""},{"$f":"IF(Start!F13=\"\",\"\",Start!F13)","v":""},{"$f":"IF(N13=\"\",\"\",'DV-V'!$J11)","v":""},{"$f":"IF(N13=\"\",\"\",'DV-V'!$O11)","v":""},{"$f":"IF(N13=\"\",\"\",'DV-V'!$Q11)","v":""},null,{"$f":"IF(N13=\"\",\"\",Výsledky!$E14)","v":""}]
[null,null,{"$f":"Start!C14","v":8},{"$f":"IF(Start!D14=\"\",\"\",Start!D14)","v":""},{"$f":"IF(Start!F14=\"\",\"\",Start!F14)","v":""},{"$f":"IF(D14=\"\",\"\",'PJ-V'!$J12)","v":""},{"$f":"IF(D14=\"\",\"\",'PJ-V'!$O12)","v":""},{"$f":"IF(D14=\"\",\"\",'PJ-V'!$Q12)","v":""},null,{"$f":"IF(D14=\"\",\"\",Výsledky!$F15)","v":""},null,null,{"$f":"Start!C14","v":8},{"$f":"IF(Start!D14=\"\",\"\",Start!D14)","v":""},{"$f":"IF(Start!F14=\"\",\"\",Start!F14)","v":""},{"$f":"IF(N14=\"\",\"\",'DV-V'!$J12)","v":""},{"$f":"IF(N14=\"\",\"\",'DV-V'!$O12)","v":""},{"$f":"IF(N14=\"\",\"\",'DV-V'!$Q12)","v":""},null,{"$f":"IF(N14=\"\",\"\",Výsledky!$E15)","v":""}]
[null,null,{"$f":"Start!C15","v":9},{"$f":"IF(Start!D15=\"\",\"\",Start!D15)","v":""},{"$f":"IF(Start!F15=\"\",\"\",Start!F15)","v":""},{"$f":"IF(D15=\"\",\"\",'PJ-V'!$J13)","v":""},{"$f":"IF(D15=\"\",\"\",'PJ-V'!$O13)","v":""},{"$f":"IF(D15=\"\",\"\",'PJ-V'!$Q13)","v":""},null,{"$f":"IF(D15=\"\",\"\",Výsledky!$F16)","v":""},null,null,{"$f":"Start!C15","v":9},{"$f":"IF(Start!D15=\"\",\"\",Start!D15)","v":""},{"$f":"IF(Start!F15=\"\",\"\",Start!F15)","v":""},{"$f":"IF(N15=\"\",\"\",'DV-V'!$J13)","v":""},{"$f":"IF(N15=\"\",\"\",'DV-V'!$O13)","v":""},{"$f":"IF(N15=\"\",\"\",'DV-V'!$Q13)","v":""},null,{"$f":"IF(N15=\"\",\"\",Výsledky!$E16)","v":""}]
[null,null,{"$f":"Start!C16","v":10},{"$f":"IF(Start!D16=\"\",\"\",Start!D16)","v":""},{"$f":"IF(Start!F16=\"\",\"\",Start!F16)","v":""},{"$f":"IF(D16=\"\",\"\",'PJ-V'!$J14)","v":""},{"$f":"IF(D16=\"\",\"\",'PJ-V'!$O14)","v":""},{"$f":"IF(D16=\"\",\"\",'PJ-V'!$Q14)","v":""},null,{"$f":"IF(D16=\"\",\"\",Výsledky!$F17)","v":""},null,null,{"$f":"Start!C16","v":10},{"$f":"IF(Start!D16=\"\",\"\",Start!D16)","v":""},{"$f":"IF(Start!F16=\"\",\"\",Start!F16)","v":""},{"$f":"IF(N16=\"\",\"\",'DV-V'!$J14)","v":""},{"$f":"IF(N16=\"\",\"\",'DV-V'!$O14)","v":""},{"$f":"IF(N16=\"\",\"\",'DV-V'!$Q14)","v":""},null,{"$f":"IF(N16=\"\",\"\",Výsledky!$E17)","v":""}]
[null,null,{"$f":"Start!C17","v":11},{"$f":"IF(Start!D17=\"\",\"\",Start!D17)","v":""},{"$f":"IF(Start!F17=\"\",\"\",Start!F17)","v":""},{"$f":"IF(D17=\"\",\"\",'PJ-V'!$J15)","v":""},{"$f":"IF(D17=\"\",\"\",'PJ-V'!$O15)","v":""},{"$f":"IF(D17=\"\",\"\",'PJ-V'!$Q15)","v":""},null,{"$f":"IF(D17=\"\",\"\",Výsledky!$F18)","v":""},null,null,{"$f":"Start!C17","v":11},{"$f":"IF(Start!D17=\"\",\"\",Start!D17)","v":""},{"$f":"IF(Start!F17=\"\",\"\",Start!F17)","v":""},{"$f":"IF(N17=\"\",\"\",'DV-V'!$J15)","v":""},{"$f":"IF(N17=\"\",\"\",'DV-V'!$O15)","v":""},{"$f":"IF(N17=\"\",\"\",'DV-V'!$Q15)","v":""},null,{"$f":"IF(N17=\"\",\"\",Výsledky!$E18)","v":""}]
[null,null,{"$f":"Start!C18","v":12},{"$f":"IF(Start!D18=\"\",\"\",Start!D18)","v":""},{"$f":"IF(Start!F18=\"\",\"\",Start!F18)","v":""},{"$f":"IF(D18=\"\",\"\",'PJ-V'!$J16)","v":""},{"$f":"IF(D18=\"\",\"\",'PJ-V'!$O16)","v":""},{"$f":"IF(D18=\"\",\"\",'PJ-V'!$Q16)","v":""},null,{"$f":"IF(D18=\"\",\"\",Výsledky!$F19)","v":""},null,null,{"$f":"Start!C18","v":12},{"$f":"IF(Start!D18=\"\",\"\",Start!D18)","v":""},{"$f":"IF(Start!F18=\"\",\"\",Start!F18)","v":""},{"$f":"IF(N18=\"\",\"\",'DV-V'!$J16)","v":""},{"$f":"IF(N18=\"\",\"\",'DV-V'!$O16)","v":""},{"$f":"IF(N18=\"\",\"\",'DV-V'!$Q16)","v":""},null,{"$f":"IF(N18=\"\",\"\",Výsledky!$E19)","v":""}]
[null,null,{"$f":"Start!C19","v":13},{"$f":"IF(Start!D19=\"\",\"\",Start!D19)","v":""},{"$f":"IF(Start!F19=\"\",\"\",Start!F19)","v":""},{"$f":"IF(D19=\"\",\"\",'PJ-V'!$J17)","v":""},{"$f":"IF(D19=\"\",\"\",'PJ-V'!$O17)","v":""},{"$f":"IF(D19=\"\",\"\",'PJ-V'!$Q17)","v":""},null,{"$f":"IF(D19=\"\",\"\",Výsledky!$F20)","v":""},null,null,{"$f":"Start!C19","v":13},{"$f":"IF(Start!D19=\"\",\"\",Start!D19)","v":""},{"$f":"IF(Start!F19=\"\",\"\",Start!F19)","v":""},{"$f":"IF(N19=\"\",\"\",'DV-V'!$J17)","v":""},{"$f":"IF(N19=\"\",\"\",'DV-V'!$O17)","v":""},{"$f":"IF(N19=\"\",\"\",'DV-V'!$Q17)","v":""},null,{"$f":"IF(N19=\"\",\"\",Výsledky!$E20)","v":""}]
[null,null,{"$f":"Start!C20","v":14},{"$f":"IF(Start!D20=\"\",\"\",Start!D20)","v":""},{"$f":"IF(Start!F20=\"\",\"\",Start!F20)","v":""},{"$f":"IF(D20=\"\",\"\",'PJ-V'!$J18)","v":""},{"$f":"IF(D20=\"\",\"\",'PJ-V'!$O18)","v":""},{"$f":"IF(D20=\"\",\"\",'PJ-V'!$Q18)","v":""},null,{"$f":"IF(D20=\"\",\"\",Výsledky!$F21)","v":""},null,null,{"$f":"Start!C20","v":14},{"$f":"IF(Start!D20=\"\",\"\",Start!D20)","v":""},{"$f":"IF(Start!F20=\"\",\"\",Start!F20)","v":""},{"$f":"IF(N20=\"\",\"\",'DV-V'!$J18)","v":""},{"$f":"IF(N20=\"\",\"\",'DV-V'!$O18)","v":""},{"$f":"IF(N20=\"\",\"\",'DV-V'!$Q18)","v":""},null,{"$f":"IF(N20=\"\",\"\",Výsledky!$E21)","v":""}]
[null,null,{"$f":"Start!C21","v":15},{"$f":"IF(Start!D21=\"\",\"\",Start!D21)","v":""},{"$f":"IF(Start!F21=\"\",\"\",Start!F21)","v":""},{"$f":"IF(D21=\"\",\"\",'PJ-V'!$J19)","v":""},{"$f":"IF(D21=\"\",\"\",'PJ-V'!$O19)","v":""},{"$f":"IF(D21=\"\",\"\",'PJ-V'!$Q19)","v":""},null,{"$f":"IF(D21=\"\",\"\",Výsledky!$F22)","v":""},null,null,{"$f":"Start!C21","v":15},{"$f":"IF(Start!D21=\"\",\"\",Start!D21)","v":""},{"$f":"IF(Start!F21=\"\",\"\",Start!F21)","v":""},{"$f":"IF(N21=\"\",\"\",'DV-V'!$J19)","v":""},{"$f":"IF(N21=\"\",\"\",'DV-V'!$O19)","v":""},{"$f":"IF(N21=\"\",\"\",'DV-V'!$Q19)","v":""},null,{"$f":"IF(N21=\"\",\"\",Výsledky!$E22)","v":""}]
[null,null,{"$f":"Start!C22","v":16},{"$f":"IF(Start!D22=\"\",\"\",Start!D22)","v":""},{"$f":"IF(Start!F22=\"\",\"\",Start!F22)","v":""},{"$f":"IF(D22=\"\",\"\",'PJ-V'!$J20)","v":""},{"$f":"IF(D22=\"\",\"\",'PJ-V'!$O20)","v":""},{"$f":"IF(D22=\"\",\"\",'PJ-V'!$Q20)","v":""},null,{"$f":"IF(D22=\"\",\"\",Výsledky!$F23)","v":""},null,null,{"$f":"Start!C22","v":16},{"$f":"IF(Start!D22=\"\",\"\",Start!D22)","v":""},{"$f":"IF(Start!F22=\"\",\"\",Start!F22)","v":""},{"$f":"IF(N22=\"\",\"\",'DV-V'!$J20)","v":""},{"$f":"IF(N22=\"\",\"\",'DV-V'!$O20)","v":""},{"$f":"IF(N22=\"\",\"\",'DV-V'!$Q20)","v":""},null,{"$f":"IF(N22=\"\",\"\",Výsledky!$E23)","v":""}]
[null,null,{"$f":"Start!C23","v":17},{"$f":"IF(Start!D23=\"\",\"\",Start!D23)","v":""},{"$f":"IF(Start!F23=\"\",\"\",Start!F23)","v":""},{"$f":"IF(D23=\"\",\"\",'PJ-V'!$J21)","v":""},{"$f":"IF(D23=\"\",\"\",'PJ-V'!$O21)","v":""},{"$f":"IF(D23=\"\",\"\",'PJ-V'!$Q21)","v":""},null,{"$f":"IF(D23=\"\",\"\",Výsledky!$F24)","v":""},null,null,{"$f":"Start!C23","v":17},{"$f":"IF(Start!D23=\"\",\"\",Start!D23)","v":""},{"$f":"IF(Start!F23=\"\",\"\",Start!F23)","v":""},{"$f":"IF(N23=\"\",\"\",'DV-V'!$J21)","v":""},{"$f":"IF(N23=\"\",\"\",'DV-V'!$O21)","v":""},{"$f":"IF(N23=\"\",\"\",'DV-V'!$Q21)","v":""},null,{"$f":"IF(N23=\"\",\"\",Výsledky!$E24)","v":""}]
[null,null,{"$f":"Start!C24","v":18},{"$f":"IF(Start!D24=\"\",\"\",Start!D24)","v":""},{"$f":"IF(Start!F24=\"\",\"\",Start!F24)","v":""},{"$f":"IF(D24=\"\",\"\",'PJ-V'!$J22)","v":""},{"$f":"IF(D24=\"\",\"\",'PJ-V'!$O22)","v":""},{"$f":"IF(D24=\"\",\"\",'PJ-V'!$Q22)","v":""},null,{"$f":"IF(D24=\"\",\"\",Výsledky!$F25)","v":""},null,null,{"$f":"Start!C24","v":18},{"$f":"IF(Start!D24=\"\",\"\",Start!D24)","v":""},{"$f":"IF(Start!F24=\"\",\"\",Start!F24)","v":""},{"$f":"IF(N24=\"\",\"\",'DV-V'!$J22)","v":""},{"$f":"IF(N24=\"\",\"\",'DV-V'!$O22)","v":""},{"$f":"IF(N24=\"\",\"\",'DV-V'!$Q22)","v":""},null,{"$f":"IF(N24=\"\",\"\",Výsledky!$E25)","v":""}]
[null,null,{"$f":"Start!C25","v":19},{"$f":"IF(Start!D25=\"\",\"\",Start!D25)","v":""},{"$f":"IF(Start!F25=\"\",\"\",Start!F25)","v":""},{"$f":"IF(D25=\"\",\"\",'PJ-V'!$J23)","v":""},{"$f":"IF(D25=\"\",\"\",'PJ-V'!$O23)","v":""},{"$f":"IF(D25=\"\",\"\",'PJ-V'!$Q23)","v":""},null,{"$f":"IF(D25=\"\",\"\",Výsledky!$F26)","v":""},null,null,{"$f":"Start!C25","v":19},{"$f":"IF(Start!D25=\"\",\"\",Start!D25)","v":""},{"$f":"IF(Start!F25=\"\",\"\",Start!F25)","v":""},{"$f":"IF(N25=\"\",\"\",'DV-V'!$J23)","v":""},{"$f":"IF(N25=\"\",\"\",'DV-V'!$O23)","v":""},{"$f":"IF(N25=\"\",\"\",'DV-V'!$Q23)","v":""},null,{"$f":"IF(N25=\"\",\"\",Výsledky!$E26)","v":""}]
[null,null,{"$f":"Start!C26","v":20},{"$f":"IF(Start!D26=\"\",\"\",Start!D26)","v":""},{"$f":"IF(Start!F26=\"\",\"\",Start!F26)","v":""},{"$f":"IF(D26=\"\",\"\",'PJ-V'!$J24)","v":""},{"$f":"IF(D26=\"\",\"\",'PJ-V'!$O24)","v":""},{"$f":"IF(D26=\"\",\"\",'PJ-V'!$Q24)","v":""},null,{"$f":"IF(D26=\"\",\"\",Výsledky!$F27)","v":""},null,null,{"$f":"Start!C26","v":20},{"$f":"IF(Start!D26=\"\",\"\",Start!D26)","v":""},{"$f":"IF(Start!F26=\"\",\"\",Start!F26)","v":""},{"$f":"IF(N26=\"\",\"\",'DV-V'!$J24)","v":""},{"$f":"IF(N26=\"\",\"\",'DV-V'!$O24)","v":""},{"$f":"IF(N26=\"\",\"\",'DV-V'!$Q24)","v":""},null,{"$f":"IF(N26=\"\",\"\",Výsledky!$E27)","v":""}]
[null,null,{"$f":"Start!C27","v":21},{"$f":"IF(Start!D27=\"\",\"\",Start!D27)","v":""},{"$f":"IF(Start!F27=\"\",\"\",Start!F27)","v":""},{"$f":"IF(D27=\"\",\"\",'PJ-V'!$J25)","v":""},{"$f":"IF(D27=\"\",\"\",'PJ-V'!$O25)","v":""},{"$f":"IF(D27=\"\",\"\",'PJ-V'!$Q25)","v":""},null,{"$f":"IF(D27=\"\",\"\",Výsledky!$F28)","v":""},null,null,{"$f":"Start!C27","v":21},{"$f":"IF(Start!D27=\"\",\"\",Start!D27)","v":""},{"$f":"IF(Start!F27=\"\",\"\",Start!F27)","v":""},{"$f":"IF(N27=\"\",\"\",'DV-V'!$J25)","v":""},{"$f":"IF(N27=\"\",\"\",'DV-V'!$O25)","v":""},{"$f":"IF(N27=\"\",\"\",'DV-V'!$Q25)","v":""},null,{"$f":"IF(N27=\"\",\"\",Výsledky!$E28)","v":""}]
[null,null,{"$f":"Start!C28","v":22},{"$f":"IF(Start!D28=\"\",\"\",Start!D28)","v":""},{"$f":"IF(Start!F28=\"\",\"\",Start!F28)","v":""},{"$f":"IF(D28=\"\",\"\",'PJ-V'!$J26)","v":""},{"$f":"IF(D28=\"\",\"\",'PJ-V'!$O26)","v":""},{"$f":"IF(D28=\"\",\"\",'PJ-V'!$Q26)","v":""},null,{"$f":"IF(D28=\"\",\"\",Výsledky!$F29)","v":""},null,null,{"$f":"Start!C28","v":22},{"$f":"IF(Start!D28=\"\",\"\",Start!D28)","v":""},{"$f":"IF(Start!F28=\"\",\"\",Start!F28)","v":""},{"$f":"IF(N28=\"\",\"\",'DV-V'!$J26)","v":""},{"$f":"IF(N28=\"\",\"\",'DV-V'!$O26)","v":""},{"$f":"IF(N28=\"\",\"\",'DV-V'!$Q26)","v":""},null,{"$f":"IF(N28=\"\",\"\",Výsledky!$E29)","v":""}]
[null,null,{"$f":"Start!C29","v":23},{"$f":"IF(Start!D29=\"\",\"\",Start!D29)","v":""},{"$f":"IF(Start!F29=\"\",\"\",Start!F29)","v":""},{"$f":"IF(D29=\"\",\"\",'PJ-V'!$J27)","v":""},{"$f":"IF(D29=\"\",\"\",'PJ-V'!$O27)","v":""},{"$f":"IF(D29=\"\",\"\",'PJ-V'!$Q27)","v":""},null,{"$f":"IF(D29=\"\",\"\",Výsledky!$F30)","v":""},null,null,{"$f":"Start!C29","v":23},{"$f":"IF(Start!D29=\"\",\"\",Start!D29)","v":""},{"$f":"IF(Start!F29=\"\",\"\",Start!F29)","v":""},{"$f":"IF(N29=\"\",\"\",'DV-V'!$J27)","v":""},{"$f":"IF(N29=\"\",\"\",'DV-V'!$O27)","v":""},{"$f":"IF(N29=\"\",\"\",'DV-V'!$Q27)","v":""},null,{"$f":"IF(N29=\"\",\"\",Výsledky!$E30)","v":""}]
[null,null,{"$f":"Start!C30","v":24},{"$f":"IF(Start!D30=\"\",\"\",Start!D30)","v":""},{"$f":"IF(Start!F30=\"\",\"\",Start!F30)","v":""},{"$f":"IF(D30=\"\",\"\",'PJ-V'!$J28)","v":""},{"$f":"IF(D30=\"\",\"\",'PJ-V'!$O28)","v":""},{"$f":"IF(D30=\"\",\"\",'PJ-V'!$Q28)","v":""},null,{"$f":"IF(D30=\"\",\"\",Výsledky!$F31)","v":""},null,null,{"$f":"Start!C30","v":24},{"$f":"IF(Start!D30=\"\",\"\",Start!D30)","v":""},{"$f":"IF(Start!F30=\"\",\"\",Start!F30)","v":""},{"$f":"IF(N30=\"\",\"\",'DV-V'!$J28)","v":""},{"$f":"IF(N30=\"\",\"\",'DV-V'!$O28)","v":""},{"$f":"IF(N30=\"\",\"\",'DV-V'!$Q28)","v":""},null,{"$f":"IF(N30=\"\",\"\",Výsledky!$E31)","v":""}]
[null,null,{"$f":"Start!C31","v":25},{"$f":"IF(Start!D31=\"\",\"\",Start!D31)","v":""},{"$f":"IF(Start!F31=\"\",\"\",Start!F31)","v":""},{"$f":"IF(D31=\"\",\"\",'PJ-V'!$J29)","v":""},{"$f":"IF(D31=\"\",\"\",'PJ-V'!$O29)","v":""},{"$f":"IF(D31=\"\",\"\",'PJ-V'!$Q29)","v":""},null,{"$f":"IF(D31=\"\",\"\",Výsledky!$F32)","v":""},null,null,{"$f":"Start!C31","v":25},{"$f":"IF(Start!D31=\"\",\"\",Start!D31)","v":""},{"$f":"IF(Start!F31=\"\",\"\",Start!F31)","v":""},{"$f":"IF(N31=\"\",\"\",'DV-V'!$J29)","v":""},{"$f":"IF(N31=\"\",\"\",'DV-V'!$O29)","v":""},{"$f":"IF(N31=\"\",\"\",'DV-V'!$Q29)","v":""},null,{"$f":"IF(N31=\"\",\"\",Výsledky!$E32)","v":""}]
[null,"Běh na 100m s překážkami",{"$f":"Start!C32","v":26},{"$f":"IF(Start!D32=\"\",\"\",Start!D32)","v":""},{"$f":"IF(Start!F32=\"\",\"\",Start!F32)","v":""},{"$f":"IF(D32=\"\",\"\",'PJ-V'!$J30)","v":""},{"$f":"IF(D32=\"\",\"\",'PJ-V'!$O30)","v":""},{"$f":"IF(D32=\"\",\"\",'PJ-V'!$Q30)","v":""},null,{"$f":"IF(D32=\"\",\"\",Výsledky!$F33)","v":""},null,"Dvojboj",{"$f":"Start!C32","v":26},{"$f":"IF(Start!D32=\"\",\"\",Start!D32)","v":""},{"$f":"IF(Start!F32=\"\",\"\",Start!F32)","v":""},{"$f":"IF(N32=\"\",\"\",'DV-V'!$J30)","v":""},{"$f":"IF(N32=\"\",\"\",'DV-V'!$O30)","v":""},{"$f":"IF(N32=\"\",\"\",'DV-V'!$Q30)","v":""},null,{"$f":"IF(N32=\"\",\"\",Výsledky!$E33)","v":""}]
[null,null,{"$f":"Start!C33","v":27},{"$f":"IF(Start!D33=\"\",\"\",Start!D33)","v":""},{"$f":"IF(Start!F33=\"\",\"\",Start!F33)","v":""},{"$f":"IF(D33=\"\",\"\",'PJ-V'!$J31)","v":""},{"$f":"IF(D33=\"\",\"\",'PJ-V'!$O31)","v":""},{"$f":"IF(D33=\"\",\"\",'PJ-V'!$Q31)","v":""},null,{"$f":"IF(D33=\"\",\"\",Výsledky!$F34)","v":""},null,null,{"$f":"Start!C33","v":27},{"$f":"IF(Start!D33=\"\",\"\",Start!D33)","v":""},{"$f":"IF(Start!F33=\"\",\"\",Start!F33)","v":""},{"$f":"IF(N33=\"\",\"\",'DV-V'!$J31)","v":""},{"$f":"IF(N33=\"\",\"\",'DV-V'!$O31)","v":""},{"$f":"IF(N33=\"\",\"\",'DV-V'!$Q31)","v":""},null,{"$f":"IF(N33=\"\",\"\",Výsledky!$E34)","v":""}]
[null,null,{"$f":"Start!C34","v":28},{"$f":"IF(Start!D34=\"\",\"\",Start!D34)","v":""},{"$f":"IF(Start!F34=\"\",\"\",Start!F34)","v":""},{"$f":"IF(D34=\"\",\"\",'PJ-V'!$J32)","v":""},{"$f":"IF(D34=\"\",\"\",'PJ-V'!$O32)","v":""},{"$f":"IF(D34=\"\",\"\",'PJ-V'!$Q32)","v":""},null,{"$f":"IF(D34=\"\",\"\",Výsledky!$F35)","v":""},null,null,{"$f":"Start!C34","v":28},{"$f":"IF(Start!D34=\"\",\"\",Start!D34)","v":""},{"$f":"IF(Start!F34=\"\",\"\",Start!F34)","v":""},{"$f":"IF(N34=\"\",\"\",'DV-V'!$J32)","v":""},{"$f":"IF(N34=\"\",\"\",'DV-V'!$O32)","v":""},{"$f":"IF(N34=\"\",\"\",'DV-V'!$Q32)","v":""},null,{"$f":"IF(N34=\"\",\"\",Výsledky!$E35)","v":""}]
[null,null,{"$f":"Start!C35","v":29},{"$f":"IF(Start!D35=\"\",\"\",Start!D35)","v":""},{"$f":"IF(Start!F35=\"\",\"\",Start!F35)","v":""},{"$f":"IF(D35=\"\",\"\",'PJ-V'!$J33)","v":""},{"$f":"IF(D35=\"\",\"\",'PJ-V'!$O33)","v":""},{"$f":"IF(D35=\"\",\"\",'PJ-V'!$Q33)","v":""},null,{"$f":"IF(D35=\"\",\"\",Výsledky!$F36)","v":""},null,null,{"$f":"Start!C35","v":29},{"$f":"IF(Start!D35=\"\",\"\",Start!D35)","v":""},{"$f":"IF(Start!F35=\"\",\"\",Start!F35)","v":""},{"$f":"IF(N35=\"\",\"\",'DV-V'!$J33)","v":""},{"$f":"IF(N35=\"\",\"\",'DV-V'!$O33)","v":""},{"$f":"IF(N35=\"\",\"\",'DV-V'!$Q33)","v":""},null,{"$f":"IF(N35=\"\",\"\",Výsledky!$E36)","v":""}]
[null,null,{"$f":"Start!C36","v":30},{"$f":"IF(Start!D36=\"\",\"\",Start!D36)","v":""},{"$f":"IF(Start!F36=\"\",\"\",Start!F36)","v":""},{"$f":"IF(D36=\"\",\"\",'PJ-V'!$J34)","v":""},{"$f":"IF(D36=\"\",\"\",'PJ-V'!$O34)","v":""},{"$f":"IF(D36=\"\",\"\",'PJ-V'!$Q34)","v":""},null,{"$f":"IF(D36=\"\",\"\",Výsledky!$F37)","v":""},null,null,{"$f":"Start!C36","v":30},{"$f":"IF(Start!D36=\"\",\"\",Start!D36)","v":""},{"$f":"IF(Start!F36=\"\",\"\",Start!F36)","v":""},{"$f":"IF(N36=\"\",\"\",'DV-V'!$J34)","v":""},{"$f":"IF(N36=\"\",\"\",'DV-V'!$O34)","v":""},{"$f":"IF(N36=\"\",\"\",'DV-V'!$Q34)","v":""},null,{"$f":"IF(N36=\"\",\"\",Výsledky!$E37)","v":""}]
[null,null,{"$f":"Start!C37","v":31},{"$f":"IF(Start!D37=\"\",\"\",Start!D37)","v":""},{"$f":"IF(Start!F37=\"\",\"\",Start!F37)","v":""},{"$f":"IF(D37=\"\",\"\",'PJ-V'!$J35)","v":""},{"$f":"IF(D37=\"\",\"\",'PJ-V'!$O35)","v":""},{"$f":"IF(D37=\"\",\"\",'PJ-V'!$Q35)","v":""},null,{"$f":"IF(D37=\"\",\"\",Výsledky!$F38)","v":""},null,null,{"$f":"Start!C37","v":31},{"$f":"IF(Start!D37=\"\",\"\",Start!D37)","v":""},{"$f":"IF(Start!F37=\"\",\"\",Start!F37)","v":""},{"$f":"IF(N37=\"\",\"\",'DV-V'!$J35)","v":""},{"$f":"IF(N37=\"\",\"\",'DV-V'!$O35)","v":""},{"$f":"IF(N37=\"\",\"\",'DV-V'!$Q35)","v":""},null,{"$f":"IF(N37=\"\",\"\",Výsledky!$E38)","v":""}]
[null,null,{"$f":"Start!C38","v":32},{"$f":"IF(Start!D38=\"\",\"\",Start!D38)","v":""},{"$f":"IF(Start!F38=\"\",\"\",Start!F38)","v":""},{"$f":"IF(D38=\"\",\"\",'PJ-V'!$J36)","v":""},{"$f":"IF(D38=\"\",\"\",'PJ-V'!$O36)","v":""},{"$f":"IF(D38=\"\",\"\",'PJ-V'!$Q36)","v":""},null,{"$f":"IF(D38=\"\",\"\",Výsledky!$F39)","v":""},null,null,{"$f":"Start!C38","v":32},{"$f":"IF(Start!D38=\"\",\"\",Start!D38)","v":""},{"$f":"IF(Start!F38=\"\",\"\",Start!F38)","v":""},{"$f":"IF(N38=\"\",\"\",'DV-V'!$J36)","v":""},{"$f":"IF(N38=\"\",\"\",'DV-V'!$O36)","v":""},{"$f":"IF(N38=\"\",\"\",'DV-V'!$Q36)","v":""},null,{"$f":"IF(N38=\"\",\"\",Výsledky!$E39)","v":""}]
[null,null,{"$f":"Start!C39","v":33},{"$f":"IF(Start!D39=\"\",\"\",Start!D39)","v":""},{"$f":"IF(Start!F39=\"\",\"\",Start!F39)","v":""},{"$f":"IF(D39=\"\",\"\",'PJ-V'!$J37)","v":""},{"$f":"IF(D39=\"\",\"\",'PJ-V'!$O37)","v":""},{"$f":"IF(D39=\"\",\"\",'PJ-V'!$Q37)","v":""},null,{"$f":"IF(D39=\"\",\"\",Výsledky!$F40)","v":""},null,null,{"$f":"Start!C39","v":33},{"$f":"IF(Start!D39=\"\",\"\",Start!D39)","v":""},{"$f":"IF(Start!F39=\"\",\"\",Start!F39)","v":""},{"$f":"IF(N39=\"\",\"\",'DV-V'!$J37)","v":""},{"$f":"IF(N39=\"\",\"\",'DV-V'!$O37)","v":""},{"$f":"IF(N39=\"\",\"\",'DV-V'!$Q37)","v":""},null,{"$f":"IF(N39=\"\",\"\",Výsledky!$E40)","v":""}]
[null,null,{"$f":"Start!C40","v":34},{"$f":"IF(Start!D40=\"\",\"\",Start!D40)","v":""},{"$f":"IF(Start!F40=\"\",\"\",Start!F40)","v":""},{"$f":"IF(D40=\"\",\"\",'PJ-V'!$J38)","v":""},{"$f":"IF(D40=\"\",\"\",'PJ-V'!$O38)","v":""},{"$f":"IF(D40=\"\",\"\",'PJ-V'!$Q38)","v":""},null,{"$f":"IF(D40=\"\",\"\",Výsledky!$F41)","v":""},null,null,{"$f":"Start!C40","v":34},{"$f":"IF(Start!D40=\"\",\"\",Start!D40)","v":""},{"$f":"IF(Start!F40=\"\",\"\",Start!F40)","v":""},{"$f":"IF(N40=\"\",\"\",'DV-V'!$J38)","v":""},{"$f":"IF(N40=\"\",\"\",'DV-V'!$O38)","v":""},{"$f":"IF(N40=\"\",\"\",'DV-V'!$Q38)","v":""},null,{"$f":"IF(N40=\"\",\"\",Výsledky!$E41)","v":""}]
[null,null,{"$f":"Start!C41","v":35},{"$f":"IF(Start!D41=\"\",\"\",Start!D41)","v":""},{"$f":"IF(Start!F41=\"\",\"\",Start!F41)","v":""},{"$f":"IF(D41=\"\",\"\",'PJ-V'!$J39)","v":""},{"$f":"IF(D41=\"\",\"\",'PJ-V'!$O39)","v":""},{"$f":"IF(D41=\"\",\"\",'PJ-V'!$Q39)","v":""},null,{"$f":"IF(D41=\"\",\"\",Výsledky!$F42)","v":""},null,null,{"$f":"Start!C41","v":35},{"$f":"IF(Start!D41=\"\",\"\",Start!D41)","v":""},{"$f":"IF(Start!F41=\"\",\"\",Start!F41)","v":""},{"$f":"IF(N41=\"\",\"\",'DV-V'!$J39)","v":""},{"$f":"IF(N41=\"\",\"\",'DV-V'!$O39)","v":""},{"$f":"IF(N41=\"\",\"\",'DV-V'!$Q39)","v":""},null,{"$f":"IF(N41=\"\",\"\",Výsledky!$E42)","v":""}]
[null,null,{"$f":"Start!C42","v":36},{"$f":"IF(Start!D42=\"\",\"\",Start!D42)","v":""},{"$f":"IF(Start!F42=\"\",\"\",Start!F42)","v":""},{"$f":"IF(D42=\"\",\"\",'PJ-V'!$J40)","v":""},{"$f":"IF(D42=\"\",\"\",'PJ-V'!$O40)","v":""},{"$f":"IF(D42=\"\",\"\",'PJ-V'!$Q40)","v":""},null,{"$f":"IF(D42=\"\",\"\",Výsledky!$F43)","v":""},null,null,{"$f":"Start!C42","v":36},{"$f":"IF(Start!D42=\"\",\"\",Start!D42)","v":""},{"$f":"IF(Start!F42=\"\",\"\",Start!F42)","v":""},{"$f":"IF(N42=\"\",\"\",'DV-V'!$J40)","v":""},{"$f":"IF(N42=\"\",\"\",'DV-V'!$O40)","v":""},{"$f":"IF(N42=\"\",\"\",'DV-V'!$Q40)","v":""},null,{"$f":"IF(N42=\"\",\"\",Výsledky!$E43)","v":""}]
[null,null,{"$f":"Start!C43","v":37},{"$f":"IF(Start!D43=\"\",\"\",Start!D43)","v":""},{"$f":"IF(Start!F43=\"\",\"\",Start!F43)","v":""},{"$f":"IF(D43=\"\",\"\",'PJ-V'!$J41)","v":""},{"$f":"IF(D43=\"\",\"\",'PJ-V'!$O41)","v":""},{"$f":"IF(D43=\"\",\"\",'PJ-V'!$Q41)","v":""},null,{"$f":"IF(D43=\"\",\"\",Výsledky!$F44)","v":""},null,null,{"$f":"Start!C43","v":37},{"$f":"IF(Start!D43=\"\",\"\",Start!D43)","v":""},{"$f":"IF(Start!F43=\"\",\"\",Start!F43)","v":""},{"$f":"IF(N43=\"\",\"\",'DV-V'!$J41)","v":""},{"$f":"IF(N43=\"\",\"\",'DV-V'!$O41)","v":""},{"$f":"IF(N43=\"\",\"\",'DV-V'!$Q41)","v":""},null,{"$f":"IF(N43=\"\",\"\",Výsledky!$E44)","v":""}]
[null,null,{"$f":"Start!C44","v":38},{"$f":"IF(Start!D44=\"\",\"\",Start!D44)","v":""},{"$f":"IF(Start!F44=\"\",\"\",Start!F44)","v":""},{"$f":"IF(D44=\"\",\"\",'PJ-V'!$J42)","v":""},{"$f":"IF(D44=\"\",\"\",'PJ-V'!$O42)","v":""},{"$f":"IF(D44=\"\",\"\",'PJ-V'!$Q42)","v":""},null,{"$f":"IF(D44=\"\",\"\",Výsledky!$F45)","v":""},null,null,{"$f":"Start!C44","v":38},{"$f":"IF(Start!D44=\"\",\"\",Start!D44)","v":""},{"$f":"IF(Start!F44=\"\",\"\",Start!F44)","v":""},{"$f":"IF(N44=\"\",\"\",'DV-V'!$J42)","v":""},{"$f":"IF(N44=\"\",\"\",'DV-V'!$O42)","v":""},{"$f":"IF(N44=\"\",\"\",'DV-V'!$Q42)","v":""},null,{"$f":"IF(N44=\"\",\"\",Výsledky!$E45)","v":""}]
[null,null,{"$f":"Start!C45","v":39},{"$f":"IF(Start!D45=\"\",\"\",Start!D45)","v":""},{"$f":"IF(Start!F45=\"\",\"\",Start!F45)","v":""},{"$f":"IF(D45=\"\",\"\",'PJ-V'!$J43)","v":""},{"$f":"IF(D45=\"\",\"\",'PJ-V'!$O43)","v":""},{"$f":"IF(D45=\"\",\"\",'PJ-V'!$Q43)","v":""},null,{"$f":"IF(D45=\"\",\"\",Výsledky!$F46)","v":""},null,null,{"$f":"Start!C45","v":39},{"$f":"IF(Start!D45=\"\",\"\",Start!D45)","v":""},{"$f":"IF(Start!F45=\"\",\"\",Start!F45)","v":""},{"$f":"IF(N45=\"\",\"\",'DV-V'!$J43)","v":""},{"$f":"IF(N45=\"\",\"\",'DV-V'!$O43)","v":""},{"$f":"IF(N45=\"\",\"\",'DV-V'!$Q43)","v":""},null,{"$f":"IF(N45=\"\",\"\",Výsledky!$E46)","v":""}]
[null,null,{"$f":"Start!C46","v":40},{"$f":"IF(Start!D46=\"\",\"\",Start!D46)","v":""},{"$f":"IF(Start!F46=\"\",\"\",Start!F46)","v":""},{"$f":"IF(D46=\"\",\"\",'PJ-V'!$J44)","v":""},{"$f":"IF(D46=\"\",\"\",'PJ-V'!$O44)","v":""},{"$f":"IF(D46=\"\",\"\",'PJ-V'!$Q44)","v":""},null,{"$f":"IF(D46=\"\",\"\",Výsledky!$F47)","v":""},null,null,{"$f":"Start!C46","v":40},{"$f":"IF(Start!D46=\"\",\"\",Start!D46)","v":""},{"$f":"IF(Start!F46=\"\",\"\",Start!F46)","v":""},{"$f":"IF(N46=\"\",\"\",'DV-V'!$J44)","v":""},{"$f":"IF(N46=\"\",\"\",'DV-V'!$O44)","v":""},{"$f":"IF(N46=\"\",\"\",'DV-V'!$Q44)","v":""},null,{"$f":"IF(N46=\"\",\"\",Výsledky!$E47)","v":""}]
[null,null,{"$f":"Start!C47","v":41},{"$f":"IF(Start!D47=\"\",\"\",Start!D47)","v":""},{"$f":"IF(Start!F47=\"\",\"\",Start!F47)","v":""},{"$f":"IF(D47=\"\",\"\",'PJ-V'!$J45)","v":""},{"$f":"IF(D47=\"\",\"\",'PJ-V'!$O45)","v":""},{"$f":"IF(D47=\"\",\"\",'PJ-V'!$Q45)","v":""},null,{"$f":"IF(D47=\"\",\"\",Výsledky!$F48)","v":""},null,null,{"$f":"Start!C47","v":41},{"$f":"IF(Start!D47=\"\",\"\",Start!D47)","v":""},{"$f":"IF(Start!F47=\"\",\"\",Start!F47)","v":""},{"$f":"IF(N47=\"\",\"\",'DV-V'!$J45)","v":""},{"$f":"IF(N47=\"\",\"\",'DV-V'!$O45)","v":""},{"$f":"IF(N47=\"\",\"\",'DV-V'!$Q45)","v":""},null,{"$f":"IF(N47=\"\",\"\",Výsledky!$E48)","v":""}]
[null,null,{"$f":"Start!C48","v":42},{"$f":"IF(Start!D48=\"\",\"\",Start!D48)","v":""},{"$f":"IF(Start!F48=\"\",\"\",Start!F48)","v":""},{"$f":"IF(D48=\"\",\"\",'PJ-V'!$J46)","v":""},{"$f":"IF(D48=\"\",\"\",'PJ-V'!$O46)","v":""},{"$f":"IF(D48=\"\",\"\",'PJ-V'!$Q46)","v":""},null,{"$f":"IF(D48=\"\",\"\",Výsledky!$F49)","v":""},null,null,{"$f":"Start!C48","v":42},{"$f":"IF(Start!D48=\"\",\"\",Start!D48)","v":""},{"$f":"IF(Start!F48=\"\",\"\",Start!F48)","v":""},{"$f":"IF(N48=\"\",\"\",'DV-V'!$J46)","v":""},{"$f":"IF(N48=\"\",\"\",'DV-V'!$O46)","v":""},{"$f":"IF(N48=\"\",\"\",'DV-V'!$Q46)","v":""},null,{"$f":"IF(N48=\"\",\"\",Výsledky!$E49)","v":""}]
[null,null,{"$f":"Start!C49","v":43},{"$f":"IF(Start!D49=\"\",\"\",Start!D49)","v":""},{"$f":"IF(Start!F49=\"\",\"\",Start!F49)","v":""},{"$f":"IF(D49=\"\",\"\",'PJ-V'!$J47)","v":""},{"$f":"IF(D49=\"\",\"\",'PJ-V'!$O47)","v":""},{"$f":"IF(D49=\"\",\"\",'PJ-V'!$Q47)","v":""},null,{"$f":"IF(D49=\"\",\"\",Výsledky!$F50)","v":""},null,null,{"$f":"Start!C49","v":43},{"$f":"IF(Start!D49=\"\",\"\",Start!D49)","v":""},{"$f":"IF(Start!F49=\"\",\"\",Start!F49)","v":""},{"$f":"IF(N49=\"\",\"\",'DV-V'!$J47)","v":""},{"$f":"IF(N49=\"\",\"\",'DV-V'!$O47)","v":""},{"$f":"IF(N49=\"\",\"\",'DV-V'!$Q47)","v":""},null,{"$f":"IF(N49=\"\",\"\",Výsledky!$E50)","v":""}]
[null,null,{"$f":"Start!C50","v":44},{"$f":"IF(Start!D50=\"\",\"\",Start!D50)","v":""},{"$f":"IF(Start!F50=\"\",\"\",Start!F50)","v":""},{"$f":"IF(D50=\"\",\"\",'PJ-V'!$J48)","v":""},{"$f":"IF(D50=\"\",\"\",'PJ-V'!$O48)","v":""},{"$f":"IF(D50=\"\",\"\",'PJ-V'!$Q48)","v":""},null,{"$f":"IF(D50=\"\",\"\",Výsledky!$F51)","v":""},null,null,{"$f":"Start!C50","v":44},{"$f":"IF(Start!D50=\"\",\"\",Start!D50)","v":""},{"$f":"IF(Start!F50=\"\",\"\",Start!F50)","v":""},{"$f":"IF(N50=\"\",\"\",'DV-V'!$J48)","v":""},{"$f":"IF(N50=\"\",\"\",'DV-V'!$O48)","v":""},{"$f":"IF(N50=\"\",\"\",'DV-V'!$Q48)","v":""},null,{"$f":"IF(N50=\"\",\"\",Výsledky!$E51)","v":""}]
[null,null,{"$f":"Start!C51","v":45},{"$f":"IF(Start!D51=\"\",\"\",Start!D51)","v":""},{"$f":"IF(Start!F51=\"\",\"\",Start!F51)","v":""},{"$f":"IF(D51=\"\",\"\",'PJ-V'!$J49)","v":""},{"$f":"IF(D51=\"\",\"\",'PJ-V'!$O49)","v":""},{"$f":"IF(D51=\"\",\"\",'PJ-V'!$Q49)","v":""},null,{"$f":"IF(D51=\"\",\"\",Výsledky!$F52)","v":""},null,null,{"$f":"Start!C51","v":45},{"$f":"IF(Start!D51=\"\",\"\",Start!D51)","v":""},{"$f":"IF(Start!F51=\"\",\"\",Start!F51)","v":""},{"$f":"IF(N51=\"\",\"\",'DV-V'!$J49)","v":""},{"$f":"IF(N51=\"\",\"\",'DV-V'!$O49)","v":""},{"$f":"IF(N51=\"\",\"\",'DV-V'!$Q49)","v":""},null,{"$f":"IF(N51=\"\",\"\",Výsledky!$E52)","v":""}]
[null,null,{"$f":"Start!C52","v":46},{"$f":"IF(Start!D52=\"\",\"\",Start!D52)","v":""},{"$f":"IF(Start!F52=\"\",\"\",Start!F52)","v":""},{"$f":"IF(D52=\"\",\"\",'PJ-V'!$J50)","v":""},{"$f":"IF(D52=\"\",\"\",'PJ-V'!$O50)","v":""},{"$f":"IF(D52=\"\",\"\",'PJ-V'!$Q50)","v":""},null,{"$f":"IF(D52=\"\",\"\",Výsledky!$F53)","v":""},null,null,{"$f":"Start!C52","v":46},{"$f":"IF(Start!D52=\"\",\"\",Start!D52)","v":""},{"$f":"IF(Start!F52=\"\",\"\",Start!F52)","v":""},{"$f":"IF(N52=\"\",\"\",'DV-V'!$J50)","v":""},{"$f":"IF(N52=\"\",\"\",'DV-V'!$O50)","v":""},{"$f":"IF(N52=\"\",\"\",'DV-V'!$Q50)","v":""},null,{"$f":"IF(N52=\"\",\"\",Výsledky!$E53)","v":""}]
[null,null,{"$f":"Start!C53","v":47},{"$f":"IF(Start!D53=\"\",\"\",Start!D53)","v":""},{"$f":"IF(Start!F53=\"\",\"\",Start!F53)","v":""},{"$f":"IF(D53=\"\",\"\",'PJ-V'!$J51)","v":""},{"$f":"IF(D53=\"\",\"\",'PJ-V'!$O51)","v":""},{"$f":"IF(D53=\"\",\"\",'PJ-V'!$Q51)","v":""},null,{"$f":"IF(D53=\"\",\"\",Výsledky!$F54)","v":""},null,null,{"$f":"Start!C53","v":47},{"$f":"IF(Start!D53=\"\",\"\",Start!D53)","v":""},{"$f":"IF(Start!F53=\"\",\"\",Start!F53)","v":""},{"$f":"IF(N53=\"\",\"\",'DV-V'!$J51)","v":""},{"$f":"IF(N53=\"\",\"\",'DV-V'!$O51)","v":""},{"$f":"IF(N53=\"\",\"\",'DV-V'!$Q51)","v":""},null,{"$f":"IF(N53=\"\",\"\",Výsledky!$E54)","v":""}]
[null,null,{"$f":"Start!C54","v":48},{"$f":"IF(Start!D54=\"\",\"\",Start!D54)","v":""},{"$f":"IF(Start!F54=\"\",\"\",Start!F54)","v":""},{"$f":"IF(D54=\"\",\"\",'PJ-V'!$J52)","v":""},{"$f":"IF(D54=\"\",\"\",'PJ-V'!$O52)","v":""},{"$f":"IF(D54=\"\",\"\",'PJ-V'!$Q52)","v":""},null,{"$f":"IF(D54=\"\",\"\",Výsledky!$F55)","v":""},null,null,{"$f":"Start!C54","v":48},{"$f":"IF(Start!D54=\"\",\"\",Start!D54)","v":""},{"$f":"IF(Start!F54=\"\",\"\",Start!F54)","v":""},{"$f":"IF(N54=\"\",\"\",'DV-V'!$J52)","v":""},{"$f":"IF(N54=\"\",\"\",'DV-V'!$O52)","v":""},{"$f":"IF(N54=\"\",\"\",'DV-V'!$Q52)","v":""},null,{"$f":"IF(N54=\"\",\"\",Výsledky!$E55)","v":""}]
[null,null,{"$f":"Start!C55","v":49},{"$f":"IF(Start!D55=\"\",\"\",Start!D55)","v":""},{"$f":"IF(Start!F55=\"\",\"\",Start!F55)","v":""},{"$f":"IF(D55=\"\",\"\",'PJ-V'!$J53)","v":""},{"$f":"IF(D55=\"\",\"\",'PJ-V'!$O53)","v":""},{"$f":"IF(D55=\"\",\"\",'PJ-V'!$Q53)","v":""},null,{"$f":"IF(D55=\"\",\"\",Výsledky!$F56)","v":""},null,null,{"$f":"Start!C55","v":49},{"$f":"IF(Start!D55=\"\",\"\",Start!D55)","v":""},{"$f":"IF(Start!F55=\"\",\"\",Start!F55)","v":""},{"$f":"IF(N55=\"\",\"\",'DV-V'!$J53)","v":""},{"$f":"IF(N55=\"\",\"\",'DV-V'!$O53)","v":""},{"$f":"IF(N55=\"\",\"\",'DV-V'!$Q53)","v":""},null,{"$f":"IF(N55=\"\",\"\",Výsledky!$E56)","v":""}]
[null,null,{"$f":"Start!C56","v":50},{"$f":"IF(Start!D56=\"\",\"\",Start!D56)","v":""},{"$f":"IF(Start!F56=\"\",\"\",Start!F56)","v":""},{"$f":"IF(D56=\"\",\"\",'PJ-V'!$J54)","v":""},{"$f":"IF(D56=\"\",\"\",'PJ-V'!$O54)","v":""},{"$f":"IF(D56=\"\",\"\",'PJ-V'!$Q54)","v":""},null,{"$f":"IF(D56=\"\",\"\",Výsledky!$F57)","v":""},null,null,{"$f":"Start!C56","v":50},{"$f":"IF(Start!D56=\"\",\"\",Start!D56)","v":""},{"$f":"IF(Start!F56=\"\",\"\",Start!F56)","v":""},{"$f":"IF(N56=\"\",\"\",'DV-V'!$J54)","v":""},{"$f":"IF(N56=\"\",\"\",'DV-V'!$O54)","v":""},{"$f":"IF(N56=\"\",\"\",'DV-V'!$Q54)","v":""},null,{"$f":"IF(N56=\"\",\"\",Výsledky!$E57)","v":""}]
[]
[null,{"$f":"B1","v":"Tisková sestava"}]
[]
[null,null,{"$f":"C3","v":"Krajské kolo soutěží dorostu"}]
[null,null,{"$f":"C4","v":"Kategorie: Dorky - Střední"},null,null,null,null,null,null,null,null,null,{"$f":"M4","v":"19. června 2021 Tachov"}]
[]
[null,"ZPV","st.č.","Jméno",{"$f":"Start!$F$6","v":"Okres"},null,null,null,null,"Poř.",null,"Test","st.č.","Jméno",{"$f":"Start!$F$6","v":"Okres"},null,null,"Tr.b.",null,"Poř."]
[null,null,{"$f":"Start!C7","v":1},{"$f":"IF(Start!D7=\"\",\"\",Start!D7)","v":"Klára Trmotová"},{"$f":"IF(Start!F7=\"\",\"\",Start!F7)","v":"KT"},null,null,null,null,{"$f":"IF(D64=\"\",\"\",Výsledky!D8)","v":"0"},null,null,{"$f":"Start!C7","v":1},{"$f":"IF(Start!D7=\"\",\"\",Start!D7)","v":"Klára Trmotová"},{"$f":"IF(Start!F7=\"\",\"\",Start!F7)","v":"KT"},null,null,{"$f":"IF(N64=\"\",\"\",TEST!F5)","v":0},null,{"$f":"IF(N64=\"\",\"\",TEST!J5)","v":1}]
[null,null,{"$f":"Start!C8","v":2},{"$f":"IF(Start!D8=\"\",\"\",Start!D8)","v":"Tereza Grünerová "},{"$f":"IF(Start!F8=\"\",\"\",Start!F8)","v":"TA"},null,null,null,null,{"$f":"IF(D65=\"\",\"\",Výsledky!D9)","v":"0"},null,null,{"$f":"Start!C8","v":2},{"$f":"IF(Start!D8=\"\",\"\",Start!D8)","v":"Tereza Grünerová "},{"$f":"IF(Start!F8=\"\",\"\",Start!F8)","v":"TA"},null,null,{"$f":"IF(N65=\"\",\"\",TEST!F6)","v":0},null,{"$f":"IF(N65=\"\",\"\",TEST!J6)","v":1}]
[null,null,{"$f":"Start!C9","v":3},{"$f":"IF(Start!D9=\"\",\"\",Start!D9)","v":"Iva Babková"},{"$f":"IF(Start!F9=\"\",\"\",Start!F9)","v":"KT"},null,null,null,null,{"$f":"IF(D66=\"\",\"\",Výsledky!D10)","v":"0"},null,null,{"$f":"Start!C9","v":3},{"$f":"IF(Start!D9=\"\",\"\",Start!D9)","v":"Iva Babková"},{"$f":"IF(Start!F9=\"\",\"\",Start!F9)","v":"KT"},null,null,{"$f":"IF(N66=\"\",\"\",TEST!F7)","v":0},null,{"$f":"IF(N66=\"\",\"\",TEST!J7)","v":1}]
[null,null,{"$f":"Start!C10","v":4},{"$f":"IF(Start!D10=\"\",\"\",Start!D10)","v":"Michaela Marešová"},{"$f":"IF(Start!F10=\"\",\"\",Start!F10)","v":"TA"},null,null,null,null,{"$f":"IF(D67=\"\",\"\",Výsledky!D11)","v":"0"},null,null,{"$f":"Start!C10","v":4},{"$f":"IF(Start!D10=\"\",\"\",Start!D10)","v":"Michaela Marešová"},{"$f":"IF(Start!F10=\"\",\"\",Start!F10)","v":"TA"},null,null,{"$f":"IF(N67=\"\",\"\",TEST!F8)","v":0},null,{"$f":"IF(N67=\"\",\"\",TEST!J8)","v":1}]
[null,null,{"$f":"Start!C11","v":5},{"$f":"IF(Start!D11=\"\",\"\",Start!D11)","v":"Adéla Stodolová"},{"$f":"IF(Start!F11=\"\",\"\",Start!F11)","v":"TA"},null,null,null,null,{"$f":"IF(D68=\"\",\"\",Výsledky!D12)","v":"0"},null,null,{"$f":"Start!C11","v":5},{"$f":"IF(Start!D11=\"\",\"\",Start!D11)","v":"Adéla Stodolová"},{"$f":"IF(Start!F11=\"\",\"\",Start!F11)","v":"TA"},null,null,{"$f":"IF(N68=\"\",\"\",TEST!F9)","v":1},null,{"$f":"IF(N68=\"\",\"\",TEST!J9)","v":5}]
[null,null,{"$f":"Start!C12","v":6},{"$f":"IF(Start!D12=\"\",\"\",Start!D12)","v":""},{"$f":"IF(Start!F12=\"\",\"\",Start!F12)","v":""},null,null,null,null,{"$f":"IF(D69=\"\",\"\",Výsledky!D13)","v":""},null,null,{"$f":"Start!C12","v":6},{"$f":"IF(Start!D12=\"\",\"\",Start!D12)","v":""},{"$f":"IF(Start!F12=\"\",\"\",Start!F12)","v":""},null,null,{"$f":"IF(N69=\"\",\"\",TEST!F10)","v":""},null,{"$f":"IF(N69=\"\",\"\",TEST!J10)","v":""}]
[null,null,{"$f":"Start!C13","v":7},{"$f":"IF(Start!D13=\"\",\"\",Start!D13)","v":""},{"$f":"IF(Start!F13=\"\",\"\",Start!F13)","v":""},null,null,null,null,{"$f":"IF(D70=\"\",\"\",Výsledky!D14)","v":""},null,null,{"$f":"Start!C13","v":7},{"$f":"IF(Start!D13=\"\",\"\",Start!D13)","v":""},{"$f":"IF(Start!F13=\"\",\"\",Start!F13)","v":""},null,null,{"$f":"IF(N70=\"\",\"\",TEST!F11)","v":""},null,{"$f":"IF(N70=\"\",\"\",TEST!J11)","v":""}]
[null,null,{"$f":"Start!C14","v":8},{"$f":"IF(Start!D14=\"\",\"\",Start!D14)","v":""},{"$f":"IF(Start!F14=\"\",\"\",Start!F14)","v":""},null,null,null,null,{"$f":"IF(D71=\"\",\"\",Výsledky!D15)","v":""},null,null,{"$f":"Start!C14","v":8},{"$f":"IF(Start!D14=\"\",\"\",Start!D14)","v":""},{"$f":"IF(Start!F14=\"\",\"\",Start!F14)","v":""},null,null,{"$f":"IF(N71=\"\",\"\",TEST!F12)","v":""},null,{"$f":"IF(N71=\"\",\"\",TEST!J12)","v":""}]
[null,null,{"$f":"Start!C15","v":9},{"$f":"IF(Start!D15=\"\",\"\",Start!D15)","v":""},{"$f":"IF(Start!F15=\"\",\"\",Start!F15)","v":""},null,null,null,null,{"$f":"IF(D72=\"\",\"\",Výsledky!D16)","v":""},null,null,{"$f":"Start!C15","v":9},{"$f":"IF(Start!D15=\"\",\"\",Start!D15)","v":""},{"$f":"IF(Start!F15=\"\",\"\",Start!F15)","v":""},null,null,{"$f":"IF(N72=\"\",\"\",TEST!F13)","v":""},null,{"$f":"IF(N72=\"\",\"\",TEST!J13)","v":""}]
[null,null,{"$f":"Start!C16","v":10},{"$f":"IF(Start!D16=\"\",\"\",Start!D16)","v":""},{"$f":"IF(Start!F16=\"\",\"\",Start!F16)","v":""},null,null,null,null,{"$f":"IF(D73=\"\",\"\",Výsledky!D17)","v":""},null,null,{"$f":"Start!C16","v":10},{"$f":"IF(Start!D16=\"\",\"\",Start!D16)","v":""},{"$f":"IF(Start!F16=\"\",\"\",Start!F16)","v":""},null,null,{"$f":"IF(N73=\"\",\"\",TEST!F14)","v":""},null,{"$f":"IF(N73=\"\",\"\",TEST!J14)","v":""}]
[null,null,{"$f":"Start!C17","v":11},{"$f":"IF(Start!D17=\"\",\"\",Start!D17)","v":""},{"$f":"IF(Start!F17=\"\",\"\",Start!F17)","v":""},null,null,null,null,{"$f":"IF(D74=\"\",\"\",Výsledky!D18)","v":""},null,null,{"$f":"Start!C17","v":11},{"$f":"IF(Start!D17=\"\",\"\",Start!D17)","v":""},{"$f":"IF(Start!F17=\"\",\"\",Start!F17)","v":""},null,null,{"$f":"IF(N74=\"\",\"\",TEST!F15)","v":""},null,{"$f":"IF(N74=\"\",\"\",TEST!J15)","v":""}]
[null,null,{"$f":"Start!C18","v":12},{"$f":"IF(Start!D18=\"\",\"\",Start!D18)","v":""},{"$f":"IF(Start!F18=\"\",\"\",Start!F18)","v":""},null,null,null,null,{"$f":"IF(D75=\"\",\"\",Výsledky!D19)","v":""},null,null,{"$f":"Start!C18","v":12},{"$f":"IF(Start!D18=\"\",\"\",Start!D18)","v":""},{"$f":"IF(Start!F18=\"\",\"\",Start!F18)","v":""},null,null,{"$f":"IF(N75=\"\",\"\",TEST!F16)","v":""},null,{"$f":"IF(N75=\"\",\"\",TEST!J16)","v":""}]
[null,null,{"$f":"Start!C19","v":13},{"$f":"IF(Start!D19=\"\",\"\",Start!D19)","v":""},{"$f":"IF(Start!F19=\"\",\"\",Start!F19)","v":""},null,null,null,null,{"$f":"IF(D76=\"\",\"\",Výsledky!D20)","v":""},null,null,{"$f":"Start!C19","v":13},{"$f":"IF(Start!D19=\"\",\"\",Start!D19)","v":""},{"$f":"IF(Start!F19=\"\",\"\",Start!F19)","v":""},null,null,{"$f":"IF(N76=\"\",\"\",TEST!F17)","v":""},null,{"$f":"IF(N76=\"\",\"\",TEST!J17)","v":""}]
[null,null,{"$f":"Start!C20","v":14},{"$f":"IF(Start!D20=\"\",\"\",Start!D20)","v":""},{"$f":"IF(Start!F20=\"\",\"\",Start!F20)","v":""},null,null,null,null,{"$f":"IF(D77=\"\",\"\",Výsledky!D21)","v":""},null,null,{"$f":"Start!C20","v":14},{"$f":"IF(Start!D20=\"\",\"\",Start!D20)","v":""},{"$f":"IF(Start!F20=\"\",\"\",Start!F20)","v":""},null,null,{"$f":"IF(N77=\"\",\"\",TEST!F18)","v":""},null,{"$f":"IF(N77=\"\",\"\",TEST!J18)","v":""}]
[null,null,{"$f":"Start!C21","v":15},{"$f":"IF(Start!D21=\"\",\"\",Start!D21)","v":""},{"$f":"IF(Start!F21=\"\",\"\",Start!F21)","v":""},null,null,null,null,{"$f":"IF(D78=\"\",\"\",Výsledky!D22)","v":""},null,null,{"$f":"Start!C21","v":15},{"$f":"IF(Start!D21=\"\",\"\",Start!D21)","v":""},{"$f":"IF(Start!F21=\"\",\"\",Start!F21)","v":""},null,null,{"$f":"IF(N78=\"\",\"\",TEST!F19)","v":""},null,{"$f":"IF(N78=\"\",\"\",TEST!J19)","v":""}]
[null,null,{"$f":"Start!C22","v":16},{"$f":"IF(Start!D22=\"\",\"\",Start!D22)","v":""},{"$f":"IF(Start!F22=\"\",\"\",Start!F22)","v":""},null,null,null,null,{"$f":"IF(D79=\"\",\"\",Výsledky!D23)","v":""},null,null,{"$f":"Start!C22","v":16},{"$f":"IF(Start!D22=\"\",\"\",Start!D22)","v":""},{"$f":"IF(Start!F22=\"\",\"\",Start!F22)","v":""},null,null,{"$f":"IF(N79=\"\",\"\",TEST!F20)","v":""},null,{"$f":"IF(N79=\"\",\"\",TEST!J20)","v":""}]
[null,null,{"$f":"Start!C23","v":17},{"$f":"IF(Start!D23=\"\",\"\",Start!D23)","v":""},{"$f":"IF(Start!F23=\"\",\"\",Start!F23)","v":""},null,null,null,null,{"$f":"IF(D80=\"\",\"\",Výsledky!D24)","v":""},null,null,{"$f":"Start!C23","v":17},{"$f":"IF(Start!D23=\"\",\"\",Start!D23)","v":""},{"$f":"IF(Start!F23=\"\",\"\",Start!F23)","v":""},null,null,{"$f":"IF(N80=\"\",\"\",TEST!F21)","v":""},null,{"$f":"IF(N80=\"\",\"\",TEST!J21)","v":""}]
[null,null,{"$f":"Start!C24","v":18},{"$f":"IF(Start!D24=\"\",\"\",Start!D24)","v":""},{"$f":"IF(Start!F24=\"\",\"\",Start!F24)","v":""},null,null,null,null,{"$f":"IF(D81=\"\",\"\",Výsledky!D25)","v":""},null,null,{"$f":"Start!C24","v":18},{"$f":"IF(Start!D24=\"\",\"\",Start!D24)","v":""},{"$f":"IF(Start!F24=\"\",\"\",Start!F24)","v":""},null,null,{"$f":"IF(N81=\"\",\"\",TEST!F22)","v":""},null,{"$f":"IF(N81=\"\",\"\",TEST!J22)","v":""}]
[null,null,{"$f":"Start!C25","v":19},{"$f":"IF(Start!D25=\"\",\"\",Start!D25)","v":""},{"$f":"IF(Start!F25=\"\",\"\",Start!F25)","v":""},null,null,null,null,{"$f":"IF(D82=\"\",\"\",Výsledky!D26)","v":""},null,null,{"$f":"Start!C25","v":19},{"$f":"IF(Start!D25=\"\",\"\",Start!D25)","v":""},{"$f":"IF(Start!F25=\"\",\"\",Start!F25)","v":""},null,null,{"$f":"IF(N82=\"\",\"\",TEST!F23)","v":""},null,{"$f":"IF(N82=\"\",\"\",TEST!J23)","v":""}]
[null,null,{"$f":"Start!C26","v":20},{"$f":"IF(Start!D26=\"\",\"\",Start!D26)","v":""},{"$f":"IF(Start!F26=\"\",\"\",Start!F26)","v":""},null,null,null,null,{"$f":"IF(D83=\"\",\"\",Výsledky!D27)","v":""},null,null,{"$f":"Start!C26","v":20},{"$f":"IF(Start!D26=\"\",\"\",Start!D26)","v":""},{"$f":"IF(Start!F26=\"\",\"\",Start!F26)","v":""},null,null,{"$f":"IF(N83=\"\",\"\",TEST!F24)","v":""},null,{"$f":"IF(N83=\"\",\"\",TEST!J24)","v":""}]
[null,null,{"$f":"Start!C27","v":21},{"$f":"IF(Start!D27=\"\",\"\",Start!D27)","v":""},{"$f":"IF(Start!F27=\"\",\"\",Start!F27)","v":""},null,null,null,null,{"$f":"IF(D84=\"\",\"\",Výsledky!D28)","v":""},null,null,{"$f":"Start!C27","v":21},{"$f":"IF(Start!D27=\"\",\"\",Start!D27)","v":""},{"$f":"IF(Start!F27=\"\",\"\",Start!F27)","v":""},null,null,{"$f":"IF(N84=\"\",\"\",TEST!F25)","v":""},null,{"$f":"IF(N84=\"\",\"\",TEST!J25)","v":""}]
[null,null,{"$f":"Start!C28","v":22},{"$f":"IF(Start!D28=\"\",\"\",Start!D28)","v":""},{"$f":"IF(Start!F28=\"\",\"\",Start!F28)","v":""},null,null,null,null,{"$f":"IF(D85=\"\",\"\",Výsledky!D29)","v":""},null,null,{"$f":"Start!C28","v":22},{"$f":"IF(Start!D28=\"\",\"\",Start!D28)","v":""},{"$f":"IF(Start!F28=\"\",\"\",Start!F28)","v":""},null,null,{"$f":"IF(N85=\"\",\"\",TEST!F26)","v":""},null,{"$f":"IF(N85=\"\",\"\",TEST!J26)","v":""}]
[null,null,{"$f":"Start!C29","v":23},{"$f":"IF(Start!D29=\"\",\"\",Start!D29)","v":""},{"$f":"IF(Start!F29=\"\",\"\",Start!F29)","v":""},null,null,null,null,{"$f":"IF(D86=\"\",\"\",Výsledky!D30)","v":""},null,null,{"$f":"Start!C29","v":23},{"$f":"IF(Start!D29=\"\",\"\",Start!D29)","v":""},{"$f":"IF(Start!F29=\"\",\"\",Start!F29)","v":""},null,null,{"$f":"IF(N86=\"\",\"\",TEST!F27)","v":""},null,{"$f":"IF(N86=\"\",\"\",TEST!J27)","v":""}]
[null,null,{"$f":"Start!C30","v":24},{"$f":"IF(Start!D30=\"\",\"\",Start!D30)","v":""},{"$f":"IF(Start!F30=\"\",\"\",Start!F30)","v":""},null,null,null,null,{"$f":"IF(D87=\"\",\"\",Výsledky!D31)","v":""},null,null,{"$f":"Start!C30","v":24},{"$f":"IF(Start!D30=\"\",\"\",Start!D30)","v":""},{"$f":"IF(Start!F30=\"\",\"\",Start!F30)","v":""},null,null,{"$f":"IF(N87=\"\",\"\",TEST!F28)","v":""},null,{"$f":"IF(N87=\"\",\"\",TEST!J28)","v":""}]
[null,null,{"$f":"Start!C31","v":25},{"$f":"IF(Start!D31=\"\",\"\",Start!D31)","v":""},{"$f":"IF(Start!F31=\"\",\"\",Start!F31)","v":""},null,null,null,null,{"$f":"IF(D88=\"\",\"\",Výsledky!D32)","v":""},null,null,{"$f":"Start!C31","v":25},{"$f":"IF(Start!D31=\"\",\"\",Start!D31)","v":""},{"$f":"IF(Start!F31=\"\",\"\",Start!F31)","v":""},null,null,{"$f":"IF(N88=\"\",\"\",TEST!F29)","v":""},null,{"$f":"IF(N88=\"\",\"\",TEST!J29)","v":""}]
[null,"ZPV",{"$f":"Start!C32","v":26},{"$f":"IF(Start!D32=\"\",\"\",Start!D32)","v":""},{"$f":"IF(Start!F32=\"\",\"\",Start!F32)","v":""},null,null,null,null,{"$f":"IF(D89=\"\",\"\",Výsledky!D33)","v":""},null,"Test",{"$f":"Start!C32","v":26},{"$f":"IF(Start!D32=\"\",\"\",Start!D32)","v":""},{"$f":"IF(Start!F32=\"\",\"\",Start!F32)","v":""},null,null,{"$f":"IF(N89=\"\",\"\",TEST!F30)","v":""},null,{"$f":"IF(N89=\"\",\"\",TEST!J30)","v":""}]
[null,null,{"$f":"Start!C33","v":27},{"$f":"IF(Start!D33=\"\",\"\",Start!D33)","v":""},{"$f":"IF(Start!F33=\"\",\"\",Start!F33)","v":""},null,null,null,null,{"$f":"IF(D90=\"\",\"\",Výsledky!D34)","v":""},null,null,{"$f":"Start!C33","v":27},{"$f":"IF(Start!D33=\"\",\"\",Start!D33)","v":""},{"$f":"IF(Start!F33=\"\",\"\",Start!F33)","v":""},null,null,{"$f":"IF(N90=\"\",\"\",TEST!F31)","v":""},null,{"$f":"IF(N90=\"\",\"\",TEST!J31)","v":""}]
[null,null,{"$f":"Start!C34","v":28},{"$f":"IF(Start!D34=\"\",\"\",Start!D34)","v":""},{"$f":"IF(Start!F34=\"\",\"\",Start!F34)","v":""},null,null,null,null,{"$f":"IF(D91=\"\",\"\",Výsledky!D35)","v":""},null,null,{"$f":"Start!C34","v":28},{"$f":"IF(Start!D34=\"\",\"\",Start!D34)","v":""},{"$f":"IF(Start!F34=\"\",\"\",Start!F34)","v":""},null,null,{"$f":"IF(N91=\"\",\"\",TEST!F32)","v":""},null,{"$f":"IF(N91=\"\",\"\",TEST!J32)","v":""}]
[null,null,{"$f":"Start!C35","v":29},{"$f":"IF(Start!D35=\"\",\"\",Start!D35)","v":""},{"$f":"IF(Start!F35=\"\",\"\",Start!F35)","v":""},null,null,null,null,{"$f":"IF(D92=\"\",\"\",Výsledky!D36)","v":""},null,null,{"$f":"Start!C35","v":29},{"$f":"IF(Start!D35=\"\",\"\",Start!D35)","v":""},{"$f":"IF(Start!F35=\"\",\"\",Start!F35)","v":""},null,null,{"$f":"IF(N92=\"\",\"\",TEST!F33)","v":""},null,{"$f":"IF(N92=\"\",\"\",TEST!J33)","v":""}]
[null,null,{"$f":"Start!C36","v":30},{"$f":"IF(Start!D36=\"\",\"\",Start!D36)","v":""},{"$f":"IF(Start!F36=\"\",\"\",Start!F36)","v":""},null,null,null,null,{"$f":"IF(D93=\"\",\"\",Výsledky!D37)","v":""},null,null,{"$f":"Start!C36","v":30},{"$f":"IF(Start!D36=\"\",\"\",Start!D36)","v":""},{"$f":"IF(Start!F36=\"\",\"\",Start!F36)","v":""},null,null,{"$f":"IF(N93=\"\",\"\",TEST!F34)","v":""},null,{"$f":"IF(N93=\"\",\"\",TEST!J34)","v":""}]
[null,null,{"$f":"Start!C37","v":31},{"$f":"IF(Start!D37=\"\",\"\",Start!D37)","v":""},{"$f":"IF(Start!F37=\"\",\"\",Start!F37)","v":""},null,null,null,null,{"$f":"IF(D94=\"\",\"\",Výsledky!D38)","v":""},null,null,{"$f":"Start!C37","v":31},{"$f":"IF(Start!D37=\"\",\"\",Start!D37)","v":""},{"$f":"IF(Start!F37=\"\",\"\",Start!F37)","v":""},null,null,{"$f":"IF(N94=\"\",\"\",TEST!F35)","v":""},null,{"$f":"IF(N94=\"\",\"\",TEST!J35)","v":""}]
[null,null,{"$f":"Start!C38","v":32},{"$f":"IF(Start!D38=\"\",\"\",Start!D38)","v":""},{"$f":"IF(Start!F38=\"\",\"\",Start!F38)","v":""},null,null,null,null,{"$f":"IF(D95=\"\",\"\",Výsledky!D39)","v":""},null,null,{"$f":"Start!C38","v":32},{"$f":"IF(Start!D38=\"\",\"\",Start!D38)","v":""},{"$f":"IF(Start!F38=\"\",\"\",Start!F38)","v":""},null,null,{"$f":"IF(N95=\"\",\"\",TEST!F36)","v":""},null,{"$f":"IF(N95=\"\",\"\",TEST!J36)","v":""}]
[null,null,{"$f":"Start!C39","v":33},{"$f":"IF(Start!D39=\"\",\"\",Start!D39)","v":""},{"$f":"IF(Start!F39=\"\",\"\",Start!F39)","v":""},null,null,null,null,{"$f":"IF(D96=\"\",\"\",Výsledky!D40)","v":""},null,null,{"$f":"Start!C39","v":33},{"$f":"IF(Start!D39=\"\",\"\",Start!D39)","v":""},{"$f":"IF(Start!F39=\"\",\"\",Start!F39)","v":""},null,null,{"$f":"IF(N96=\"\",\"\",TEST!F37)","v":""},null,{"$f":"IF(N96=\"\",\"\",TEST!J37)","v":""}]
[null,null,{"$f":"Start!C40","v":34},{"$f":"IF(Start!D40=\"\",\"\",Start!D40)","v":""},{"$f":"IF(Start!F40=\"\",\"\",Start!F40)","v":""},null,null,null,null,{"$f":"IF(D97=\"\",\"\",Výsledky!D41)","v":""},null,null,{"$f":"Start!C40","v":34},{"$f":"IF(Start!D40=\"\",\"\",Start!D40)","v":""},{"$f":"IF(Start!F40=\"\",\"\",Start!F40)","v":""},null,null,{"$f":"IF(N97=\"\",\"\",TEST!F38)","v":""},null,{"$f":"IF(N97=\"\",\"\",TEST!J38)","v":""}]
[null,null,{"$f":"Start!C41","v":35},{"$f":"IF(Start!D41=\"\",\"\",Start!D41)","v":""},{"$f":"IF(Start!F41=\"\",\"\",Start!F41)","v":""},null,null,null,null,{"$f":"IF(D98=\"\",\"\",Výsledky!D42)","v":""},null,null,{"$f":"Start!C41","v":35},{"$f":"IF(Start!D41=\"\",\"\",Start!D41)","v":""},{"$f":"IF(Start!F41=\"\",\"\",Start!F41)","v":""},null,null,{"$f":"IF(N98=\"\",\"\",TEST!F39)","v":""},null,{"$f":"IF(N98=\"\",\"\",TEST!J39)","v":""}]
[null,null,{"$f":"Start!C42","v":36},{"$f":"IF(Start!D42=\"\",\"\",Start!D42)","v":""},{"$f":"IF(Start!F42=\"\",\"\",Start!F42)","v":""},null,null,null,null,{"$f":"IF(D99=\"\",\"\",Výsledky!D43)","v":""},null,null,{"$f":"Start!C42","v":36},{"$f":"IF(Start!D42=\"\",\"\",Start!D42)","v":""},{"$f":"IF(Start!F42=\"\",\"\",Start!F42)","v":""},null,null,{"$f":"IF(N99=\"\",\"\",TEST!F40)","v":""},null,{"$f":"IF(N99=\"\",\"\",TEST!J40)","v":""}]
[null,null,{"$f":"Start!C43","v":37},{"$f":"IF(Start!D43=\"\",\"\",Start!D43)","v":""},{"$f":"IF(Start!F43=\"\",\"\",Start!F43)","v":""},null,null,null,null,{"$f":"IF(D100=\"\",\"\",Výsledky!D44)","v":""},null,null,{"$f":"Start!C43","v":37},{"$f":"IF(Start!D43=\"\",\"\",Start!D43)","v":""},{"$f":"IF(Start!F43=\"\",\"\",Start!F43)","v":""},null,null,{"$f":"IF(N100=\"\",\"\",TEST!F41)","v":""},null,{"$f":"IF(N100=\"\",\"\",TEST!J41)","v":""}]
[null,null,{"$f":"Start!C44","v":38},{"$f":"IF(Start!D44=\"\",\"\",Start!D44)","v":""},{"$f":"IF(Start!F44=\"\",\"\",Start!F44)","v":""},null,null,null,null,{"$f":"IF(D101=\"\",\"\",Výsledky!D45)","v":""},null,null,{"$f":"Start!C44","v":38},{"$f":"IF(Start!D44=\"\",\"\",Start!D44)","v":""},{"$f":"IF(Start!F44=\"\",\"\",Start!F44)","v":""},null,null,{"$f":"IF(N101=\"\",\"\",TEST!F42)","v":""},null,{"$f":"IF(N101=\"\",\"\",TEST!J42)","v":""}]
[null,null,{"$f":"Start!C45","v":39},{"$f":"IF(Start!D45=\"\",\"\",Start!D45)","v":""},{"$f":"IF(Start!F45=\"\",\"\",Start!F45)","v":""},null,null,null,null,{"$f":"IF(D102=\"\",\"\",Výsledky!D46)","v":""},null,null,{"$f":"Start!C45","v":39},{"$f":"IF(Start!D45=\"\",\"\",Start!D45)","v":""},{"$f":"IF(Start!F45=\"\",\"\",Start!F45)","v":""},null,null,{"$f":"IF(N102=\"\",\"\",TEST!F43)","v":""},null,{"$f":"IF(N102=\"\",\"\",TEST!J43)","v":""}]
[null,null,{"$f":"Start!C46","v":40},{"$f":"IF(Start!D46=\"\",\"\",Start!D46)","v":""},{"$f":"IF(Start!F46=\"\",\"\",Start!F46)","v":""},null,null,null,null,{"$f":"IF(D103=\"\",\"\",Výsledky!D47)","v":""},null,null,{"$f":"Start!C46","v":40},{"$f":"IF(Start!D46=\"\",\"\",Start!D46)","v":""},{"$f":"IF(Start!F46=\"\",\"\",Start!F46)","v":""},null,null,{"$f":"IF(N103=\"\",\"\",TEST!F44)","v":""},null,{"$f":"IF(N103=\"\",\"\",TEST!J44)","v":""}]
[null,null,{"$f":"Start!C47","v":41},{"$f":"IF(Start!D47=\"\",\"\",Start!D47)","v":""},{"$f":"IF(Start!F47=\"\",\"\",Start!F47)","v":""},null,null,null,null,{"$f":"IF(D104=\"\",\"\",Výsledky!D48)","v":""},null,null,{"$f":"Start!C47","v":41},{"$f":"IF(Start!D47=\"\",\"\",Start!D47)","v":""},{"$f":"IF(Start!F47=\"\",\"\",Start!F47)","v":""},null,null,{"$f":"IF(N104=\"\",\"\",TEST!F45)","v":""},null,{"$f":"IF(N104=\"\",\"\",TEST!J45)","v":""}]
[null,null,{"$f":"Start!C48","v":42},{"$f":"IF(Start!D48=\"\",\"\",Start!D48)","v":""},{"$f":"IF(Start!F48=\"\",\"\",Start!F48)","v":""},null,null,null,null,{"$f":"IF(D105=\"\",\"\",Výsledky!D49)","v":""},null,null,{"$f":"Start!C48","v":42},{"$f":"IF(Start!D48=\"\",\"\",Start!D48)","v":""},{"$f":"IF(Start!F48=\"\",\"\",Start!F48)","v":""},null,null,{"$f":"IF(N105=\"\",\"\",TEST!F46)","v":""},null,{"$f":"IF(N105=\"\",\"\",TEST!J46)","v":""}]
[null,null,{"$f":"Start!C49","v":43},{"$f":"IF(Start!D49=\"\",\"\",Start!D49)","v":""},{"$f":"IF(Start!F49=\"\",\"\",Start!F49)","v":""},null,null,null,null,{"$f":"IF(D106=\"\",\"\",Výsledky!D50)","v":""},null,null,{"$f":"Start!C49","v":43},{"$f":"IF(Start!D49=\"\",\"\",Start!D49)","v":""},{"$f":"IF(Start!F49=\"\",\"\",Start!F49)","v":""},null,null,{"$f":"IF(N106=\"\",\"\",TEST!F47)","v":""},null,{"$f":"IF(N106=\"\",\"\",TEST!J47)","v":""}]
[null,null,{"$f":"Start!C50","v":44},{"$f":"IF(Start!D50=\"\",\"\",Start!D50)","v":""},{"$f":"IF(Start!F50=\"\",\"\",Start!F50)","v":""},null,null,null,null,{"$f":"IF(D107=\"\",\"\",Výsledky!D51)","v":""},null,null,{"$f":"Start!C50","v":44},{"$f":"IF(Start!D50=\"\",\"\",Start!D50)","v":""},{"$f":"IF(Start!F50=\"\",\"\",Start!F50)","v":""},null,null,{"$f":"IF(N107=\"\",\"\",TEST!F48)","v":""},null,{"$f":"IF(N107=\"\",\"\",TEST!J48)","v":""}]
[null,null,{"$f":"Start!C51","v":45},{"$f":"IF(Start!D51=\"\",\"\",Start!D51)","v":""},{"$f":"IF(Start!F51=\"\",\"\",Start!F51)","v":""},null,null,null,null,{"$f":"IF(D108=\"\",\"\",Výsledky!D52)","v":""},null,null,{"$f":"Start!C51","v":45},{"$f":"IF(Start!D51=\"\",\"\",Start!D51)","v":""},{"$f":"IF(Start!F51=\"\",\"\",Start!F51)","v":""},null,null,{"$f":"IF(N108=\"\",\"\",TEST!F49)","v":""},null,{"$f":"IF(N108=\"\",\"\",TEST!J49)","v":""}]
[null,null,{"$f":"Start!C52","v":46},{"$f":"IF(Start!D52=\"\",\"\",Start!D52)","v":""},{"$f":"IF(Start!F52=\"\",\"\",Start!F52)","v":""},null,null,null,null,{"$f":"IF(D109=\"\",\"\",Výsledky!D53)","v":""},null,null,{"$f":"Start!C52","v":46},{"$f":"IF(Start!D52=\"\",\"\",Start!D52)","v":""},{"$f":"IF(Start!F52=\"\",\"\",Start!F52)","v":""},null,null,{"$f":"IF(N109=\"\",\"\",TEST!F50)","v":""},null,{"$f":"IF(N109=\"\",\"\",TEST!J50)","v":""}]
[null,null,{"$f":"Start!C53","v":47},{"$f":"IF(Start!D53=\"\",\"\",Start!D53)","v":""},{"$f":"IF(Start!F53=\"\",\"\",Start!F53)","v":""},null,null,null,null,{"$f":"IF(D110=\"\",\"\",Výsledky!D54)","v":""},null,null,{"$f":"Start!C53","v":47},{"$f":"IF(Start!D53=\"\",\"\",Start!D53)","v":""},{"$f":"IF(Start!F53=\"\",\"\",Start!F53)","v":""},null,null,{"$f":"IF(N110=\"\",\"\",TEST!F51)","v":""},null,{"$f":"IF(N110=\"\",\"\",TEST!J51)","v":""}]
[null,null,{"$f":"Start!C54","v":48},{"$f":"IF(Start!D54=\"\",\"\",Start!D54)","v":""},{"$f":"IF(Start!F54=\"\",\"\",Start!F54)","v":""},null,null,null,null,{"$f":"IF(D111=\"\",\"\",Výsledky!D55)","v":""},null,null,{"$f":"Start!C54","v":48},{"$f":"IF(Start!D54=\"\",\"\",Start!D54)","v":""},{"$f":"IF(Start!F54=\"\",\"\",Start!F54)","v":""},null,null,{"$f":"IF(N111=\"\",\"\",TEST!F52)","v":""},null,{"$f":"IF(N111=\"\",\"\",TEST!J52)","v":""}]
[null,null,{"$f":"Start!C55","v":49},{"$f":"IF(Start!D55=\"\",\"\",Start!D55)","v":""},{"$f":"IF(Start!F55=\"\",\"\",Start!F55)","v":""},null,null,null,null,{"$f":"IF(D112=\"\",\"\",Výsledky!D56)","v":""},null,null,{"$f":"Start!C55","v":49},{"$f":"IF(Start!D55=\"\",\"\",Start!D55)","v":""},{"$f":"IF(Start!F55=\"\",\"\",Start!F55)","v":""},null,null,{"$f":"IF(N112=\"\",\"\",TEST!F53)","v":""},null,{"$f":"IF(N112=\"\",\"\",TEST!J53)","v":""}]
[null,null,{"$f":"Start!C56","v":50},{"$f":"IF(Start!D56=\"\",\"\",Start!D56)","v":""},{"$f":"IF(Start!F56=\"\",\"\",Start!F56)","v":""},null,null,null,null,{"$f":"IF(D113=\"\",\"\",Výsledky!D57)","v":""},null,null,{"$f":"Start!C56","v":50},{"$f":"IF(Start!D56=\"\",\"\",Start!D56)","v":""},{"$f":"IF(Start!F56=\"\",\"\",Start!F56)","v":""},null,null,{"$f":"IF(N113=\"\",\"\",TEST!F54)","v":""},null,{"$f":"IF(N113=\"\",\"\",TEST!J54)","v":""}]

{"sheet":"Tisk-v2","index":16,"n_rows":116,"n_cols":16,"rows_kept":116,"cut":false,"hidden":false,"merged":[[108,0,109,0],[108,1,109,1],[108,2,109,2],[108,3,109,3],[108,4,109,4],[104,11,105,11],[104,12,105,12],[104,13,105,13],[104,14,105,14],[108,13,109,13],[108,5,109,5],[108,7,109,7],[106,5,107,5],[106,7,107,7],[106,9,107,9],[106,13,107,13],[106,0,107,0],[106,1,107,1],[106,2,107,2],[106,3,107,3],[106,4,107,4],[104,0,105,0],[104,1,105,1],[104,2,105,2],[102,0,103,0],[102,1,103,1],[102,2,103,2],[102,3,103,3],[76,7,77,7],[80,0,81,0],[80,1,81,1],[80,2,81,2],[80,3,81,3],[80,4,81,4],[80,5,81,5],[88,1,89,1],[88,2,89,2],[88,3,89,3],[88,4,89,4],[88,5,89,5],[78,0,79,0],[78,1,79,1],[78,2,79,2],[100,0,101,0],[100,1,101,1],[72,4,73,4],[72,5,73,5],[104,3,105,3],[104,4,105,4],[104,5,105,5],[104,7,105,7],[104,9,105,9],[104,10,105,10],[74,5,75,5],[80,10,81,10],[78,3,79,3],[78,4,79,4],[78,5,79,5],[100,3,101,3],[102,15,103,15],[102,4,103,4],[70,10,71,10],[70,11,71,11],[70,12,71,12],[70,13,71,13],[70,14,71,14],[70,15,71,15],[68,14,69,14],[68,15,69,15],[68,10,69,10],[68,11,69,11],[68,12,69,12],[68,13,69,13],[78,15,79,15],[74,9,75,9],[72,12,73,12],[74,10,75,10],[72,10,73,10],[72,11,73,11],[74,11,75,11],[74,12,75,12],[78,7,79,7],[78,9,79,9],[63,10,63,11],[63,13,65,13],[63,15,65,15],[64,12,65,12],[64,14,65,14],[64,11,65,11],[56,13,57,13],[60,7,60,13],[70,0,71,0],[70,1,71,1],[70,2,71,2],[70,3,71,3],[70,4,71,4],[70,5,71,5],[70,7,71,7],[70,9,71,9],[68,7,69,7],[68,9,69,9],[68,0,69,0],[68,1,69,1],[68,2,69,2],[68,3,69,3],[68,4,69,4],[68,5,69,5],[58,1,58,15],[60,2,60,6],[46,11,47,11],[46,15,47,15],[56,10,57,10],[48,14,49,14],[46,14,47,14],[52,14,53,14],[50,14,51,14],[56,14,57,14],[54,14,55,14],[48,15,49,15],[40,0,41,0],[40,1,41,1],[40,2,41,2],[40,3,41,3],[40,4,41,4],[40,13,41,13],[40,10,41,10],[40,12,41,12],[36,14,37,14],[40,9,41,9],[40,11,41,11],[38,0,39,0],[38,1,39,1],[38,2,39,2],[38,3,39,3],[38,4,39,4],[38,5,39,5],[38,7,39,7],[38,14,39,14],[36,0,37,0],[36,1,37,1],[36,2,37,2],[36,3,37,3],[36,4,37,4],[30,3,31,3],[28,0,29,0],[28,1,29,1],[28,2,29,2],[28,3,29,3],[34,5,35,5],[34,7,35,7],[28,5,29,5],[28,7,29,7],[30,5,31,5],[34,0,35,0],[34,1,35,1],[34,2,35,2],[34,3,35,3],[34,4,35,4],[30,4,31,4],[28,4,29,4],[32,0,33,0],[32,1,33,1],[32,2,33,2],[32,3,33,3],[10,14,11,14],[20,14,21,14],[32,14,33,14],[30,14,31,14],[28,14,29,14],[24,14,25,14],[22,14,23,14],[18,14,19,14],[26,11,27,11],[20,11,21,11],[26,12,27,12],[18,13,19,13],[26,14,27,14],[10,12,11,12],[18,12,19,12],[20,12,21,12],[22,12,23,12],[30,0,31,0],[30,1,31,1],[30,2,31,2],[8,10,9,10],[2,2,2,6],[2,7,2,13],[5,3,7,3],[50,12,51,12],[54,12,55,12],[56,12,57,12],[52,12,53,12],[52,13,53,13],[46,12,47,12],[48,12,49,12],[42,13,43,13],[14,12,15,12],[14,5,15,5],[42,4,43,4],[44,5,45,5],[42,3,43,3],[44,3,45,3],[44,7,45,7],[42,7,43,7],[44,4,45,4],[8,13,9,13],[36,5,37,5],[36,10,37,10],[34,14,35,14],[32,10,33,10],[28,12,29,12],[30,12,31,12],[32,12,33,12],[34,10,35,10],[24,12,25,12],[16,11,17,11],[18,11,19,11],[16,10,17,10],[32,13,33,13],[28,13,29,13],[26,13,27,13],[24,13,25,13],[30,13,31,13],[30,11,31,11],[34,12,35,12],[28,10,29,10],[0,1,0,15],[8,12,9,12],[6,12,7,12],[6,14,7,14],[8,14,9,14],[8,9,9,9],[6,5,7,5],[4,6,4,7],[4,8,4,9],[6,10,7,10],[5,15,7,15],[5,1,7,1],[5,2,7,2],[6,11,7,11],[8,5,9,5],[6,7,7,7],[6,9,7,9],[5,8,5,9],[5,4,7,4],[5,10,5,11],[8,3,9,3],[8,4,9,4],[5,13,7,13],[4,10,4,11],[8,15,9,15],[10,15,11,15],[12,15,13,15],[8,11,9,11],[30,15,31,15],[32,15,33,15],[12,12,13,12],[16,12,17,12],[24,15,25,15],[26,15,27,15],[28,15,29,15],[28,11,29,11],[14,14,15,14],[12,14,13,14],[16,14,17,14],[10,11,11,11],[12,11,13,11],[14,15,15,15],[16,15,17,15],[18,15,19,15],[22,11,23,11],[14,11,15,11],[16,5,17,5],[16,4,17,4],[32,5,33,5],[30,7,31,7],[32,4,33,4],[30,9,31,9],[30,10,31,10],[20,15,21,15],[32,11,33,11],[22,15,23,15],[28,9,29,9],[22,0,23,0],[22,1,23,1],[22,2,23,2],[22,4,23,4],[24,0,25,0],[26,7,27,7],[26,9,27,9],[22,9,23,9],[22,3,23,3],[24,3,25,3],[24,2,25,2],[22,5,23,5],[22,7,23,7],[24,5,25,5],[24,7,25,7],[24,4,25,4],[26,4,27,4],[24,1,25,1],[26,0,27,0],[26,1,27,1],[26,2,27,2],[26,3,27,3],[24,9,25,9],[18,0,19,0],[18,1,19,1],[18,2,19,2],[18,4,19,4],[20,1,21,1],[20,2,21,2],[20,4,21,4],[20,0,21,0],[18,10,19,10],[18,3,19,3],[20,3,21,3],[20,10,21,10],[20,7,21,7],[8,0,9,0],[8,1,9,1],[8,2,9,2],[16,0,17,0],[14,1,15,1],[14,2,15,2],[10,3,11,3],[50,13,51,13],[10,13,11,13],[12,13,13,13],[46,13,47,13],[14,13,15,13],[20,13,21,13],[22,13,23,13],[34,13,35,13],[16,13,17,13],[36,13,37,13],[48,13,49,13],[18,5,19,5],[18,7,19,7],[18,9,19,9],[20,5,21,5],[20,9,21,9],[26,5,27,5],[10,0,11,0],[10,1,11,1],[10,2,11,2],[16,1,17,1],[16,2,17,2],[12,0,13,0],[12,1,13,1],[14,0,15,0],[10,9,11,9],[14,9,15,9],[14,7,15,7],[12,9,13,9],[12,7,13,7],[12,3,13,3],[12,2,13,2],[14,3,15,3],[16,9,17,9],[16,3,17,3],[12,5,13,5],[10,5,11,5],[10,4,11,4],[12,4,13,4],[10,7,11,7],[14,4,15,4],[46,0,47,0],[46,1,47,1],[46,2,47,2],[42,0,43,0],[42,1,43,1],[42,2,43,2],[44,0,45,0],[44,1,45,1],[44,2,45,2],[48,0,49,0],[52,7,53,7],[52,5,53,5],[52,3,53,3],[52,4,53,4],[48,4,49,4],[52,0,53,0],[52,1,53,1],[50,4,51,4],[50,3,51,3],[48,3,49,3],[52,2,53,2],[50,0,51,0],[48,2,49,2],[50,1,51,1],[50,2,51,2],[48,1,49,1],[50,7,51,7],[50,5,51,5],[48,7,49,7],[48,5,49,5],[56,0,57,0],[56,1,57,1],[56,2,57,2],[56,7,57,7],[56,4,57,4],[54,0,55,0],[54,1,55,1],[54,2,55,2],[54,7,55,7],[54,4,55,4],[56,3,57,3],[56,5,57,5],[54,5,55,5],[54,3,55,3],[42,15,43,15],[34,15,35,15],[38,15,39,15],[40,15,41,15],[50,15,51,15],[44,15,45,15],[64,10,65,10],[52,15,53,15],[54,15,55,15],[56,15,57,15],[56,11,57,11],[54,13,55,13],[46,10,47,10],[48,10,49,10],[38,10,39,10],[38,11,39,11],[38,13,39,13],[42,14,43,14],[54,11,55,11],[42,12,43,12],[36,12,37,12],[38,12,39,12],[44,10,45,10],[36,15,37,15],[5,6,5,7],[8,7,9,7],[76,1,77,1],[76,2,77,2],[76,3,77,3],[76,4,77,4],[76,5,77,5],[76,10,77,10],[76,11,77,11],[63,1,65,1],[63,2,65,2],[64,7,65,7],[64,5,65,5],[63,3,65,3],[63,4,65,4],[63,6,63,7],[46,4,47,4],[46,3,47,3],[46,7,47,7],[46,5,47,5],[62,6,62,7],[22,10,23,10],[24,10,25,10],[26,10,27,10],[76,12,77,12],[10,10,11,10],[12,10,13,10],[14,10,15,10],[44,9,45,9],[32,7,33,7],[32,9,33,9],[34,9,35,9],[36,7,37,7],[36,9,37,9],[74,7,75,7],[44,12,45,12],[66,10,67,10],[66,11,67,11],[66,12,67,12],[24,11,25,11],[34,11,35,11],[16,7,17,7],[36,11,37,11],[38,9,39,9],[54,9,55,9],[54,10,55,10],[62,8,62,9],[62,10,62,11],[72,13,73,13],[74,14,75,14],[76,14,77,14],[76,15,77,15],[72,9,73,9],[76,0,77,0],[78,10,79,10],[78,11,79,11],[78,12,79,12],[78,13,79,13],[72,7,73,7],[72,14,73,14],[72,15,73,15],[74,0,75,0],[74,1,75,1],[74,2,75,2],[74,3,75,3],[74,4,75,4],[74,13,75,13],[74,15,75,15],[72,0,73,0],[72,1,73,1],[72,2,73,2],[72,3,73,3],[78,14,79,14],[76,9,77,9],[76,13,77,13],[80,14,81,14],[80,15,81,15],[82,0,83,0],[82,1,83,1],[82,2,83,2],[82,3,83,3],[82,4,83,4],[82,5,83,5],[82,7,83,7],[82,9,83,9],[82,14,83,14],[82,15,83,15],[80,7,81,7],[80,9,81,9],[82,10,83,10],[82,11,83,11],[82,12,83,12],[82,13,83,13],[80,11,81,11],[80,12,81,12],[80,13,81,13],[84,14,85,14],[84,15,85,15],[86,0,87,0],[86,1,87,1],[86,2,87,2],[86,3,87,3],[86,4,87,4],[86,5,87,5],[86,7,87,7],[86,9,87,9],[86,14,87,14],[86,15,87,15],[84,7,85,7],[84,9,85,9],[86,10,87,10],[86,11,87,11],[86,12,87,12],[86,13,87,13],[84,0,85,0],[84,1,85,1],[84,2,85,2],[84,3,85,3],[84,4,85,4],[84,5,85,5],[84,13,85,13],[84,10,85,10],[84,11,85,11],[84,12,85,12],[92,5,93,5],[92,10,93,10],[92,11,93,11],[92,12,93,12],[88,13,89,13],[92,13,93,13],[92,3,93,3],[92,4,93,4],[88,14,89,14],[88,15,89,15],[90,0,91,0],[90,1,91,1],[90,2,91,2],[90,3,91,3],[90,4,91,4],[90,5,91,5],[90,7,91,7],[90,9,91,9],[90,14,91,14],[90,15,91,15],[88,7,89,7],[88,9,89,9],[90,10,91,10],[90,11,91,11],[90,12,91,12],[90,13,91,13],[88,0,89,0],[88,10,89,10],[88,11,89,11],[88,12,89,12],[96,10,97,10],[96,11,97,11],[96,12,97,12],[92,14,93,14],[92,15,93,15],[94,0,95,0],[94,1,95,1],[94,2,95,2],[94,3,95,3],[94,4,95,4],[94,5,95,5],[94,7,95,7],[94,9,95,9],[94,14,95,14],[94,15,95,15],[92,7,93,7],[92,9,93,9],[94,10,95,10],[94,11,95,11],[94,12,95,12],[94,13,95,13],[92,0,93,0],[92,1,93,1],[92,2,93,2],[98,0,99,0],[98,1,99,1],[98,2,99,2],[98,3,99,3],[98,4,99,4],[98,5,99,5],[98,7,99,7],[98,9,99,9],[96,7,97,7],[96,9,97,9],[96,0,97,0],[96,1,97,1],[96,2,97,2],[96,3,97,3],[96,4,97,4],[96,5,97,5],[104,15,105,15],[108,15,109,15],[106,12,107,12],[108,14,109,14],[108,10,109,10],[108,11,109,11],[108,12,109,12],[106,14,107,14],[106,15,107,15],[108,9,109,9],[98,14,99,14],[98,10,99,10],[102,10,103,10],[102,11,103,11],[102,12,103,12],[102,13,103,13],[102,14,103,14],[106,10,107,10],[106,11,107,11],[110,13,111,13],[112,10,113,10],[114,10,115,10],[110,15,111,15],[112,0,113,0],[112,1,113,1],[112,2,113,2],[112,3,113,3],[112,4,113,4],[112,5,113,5],[112,7,113,7],[112,9,113,9],[110,10,111,10],[112,15,113,15],[110,0,111,0],[110,1,111,1],[110,2,111,2],[110,3,111,3],[110,4,111,4],[110,5,111,5],[110,7,111,7],[110,9,111,9],[114,0,115,0],[114,1,115,1],[114,2,115,2],[114,3,115,3],[114,4,115,4],[114,5,115,5],[114,7,115,7],[114,9,115,9],[110,11,111,11],[44,11,45,11],[66,5,67,5],[66,7,67,7],[66,9,67,9],[56,9,57,9],[64,9,65,9],[63,8,63,9],[46,9,47,9],[48,11,49,11],[50,11,51,11],[52,10,53,10],[52,11,53,11],[52,9,53,9],[50,10,51,10],[48,9,49,9],[50,9,51,9],[100,2,101,2],[114,15,115,15],[40,5,41,5],[40,7,41,7],[40,14,41,14],[42,5,43,5],[42,9,43,9],[42,10,43,10],[42,11,43,11],[44,14,45,14],[102,5,103,5],[102,7,103,7],[102,9,103,9],[114,11,115,11],[114,12,115,12],[114,13,115,13],[112,14,113,14],[112,11,113,11],[112,12,113,12],[112,13,113,13],[110,14,111,14],[44,13,45,13],[114,14,115,14],[110,12,111,12],[66,15,67,15],[66,13,67,13],[98,15,99,15],[100,10,101,10],[100,4,101,4],[100,5,101,5],[100,7,101,7],[100,9,101,9],[66,0,67,0],[66,1,67,1],[66,2,67,2],[66,3,67,3],[66,14,67,14],[66,4,67,4],[100,11,101,11],[100,12,101,12],[100,13,101,13],[100,14,101,14],[100,15,101,15],[98,11,99,11],[98,12,99,12],[98,13,99,13],[96,13,97,13],[96,14,97,14],[96,15,97,15]]}
[null,"Celkové výsledky - TISK"]
[]
[null,null,{"$f":"Start!$B$2","v":"Krajské kolo soutěží dorostu"},null,null,null,null,{"$f":"Start!$B$3","v":"19. června 2021 Tachov"}]
[]
[null,null,{"$f":"Start!$D$5","v":"Dorky - Střední"}]
[null," startovní číslo","Jméno","SDH",{"$f":"Start!$F$6","v":"Okres"}," ZPV","Běh na 100m s překážkami",null,"Dvojboj",null,"Test",null,null," Celkový součet bodů",null,"Celkové pořadí"]
[null,null,null,null,null,"P.","1.pokus","P.","1.pokus","P.","Tr.Bodů","P."]
[null,null,null,null,null,null,"2.pokus",null,"2.pokus"]
[null,{"$f":"Start!$C7","v":1},{"$f":"IF(Start!$D7=\"\",\"\",Start!$D7)","v":"Klára Trmotová"},{"$f":"IF(Start!$E$7=\"\",\"\",Start!$E$7)","v":"Dlažov"},{"$f":"IF(Start!$F$7=\"\",\"\",Start!$F$7)","v":"KT"},{"$f":"IF($C9=\"\",\"\",IF(V.l.ZPV!$C$6=\"\",\"0\",IF(ISNA(MATCH($C9,ZPVOblN,0)),COUNTIF(ZPVOblT,\".\")+1,LOOKUP($C9,ZPVOblN,ZPVOblD))))","v":"0"},{"$f":"IF($C9=\"\",\"\",'PJ-V'!$J5)","v":33.979999999999997},{"$f":"IF($C9=\"\",\"\",LOOKUP($C9,'PJ - P'!$Y$1:$Y$50,'PJ - P'!$Z$1:$Z$50))","v":2},{"$f":"IF($C9=\"\",\"\",'DV-V'!$J5)","v":"DNF"},{"$f":"IF($C9=\"\",\"\",LOOKUP($C9,'DV - P'!$Y$1:$Y$50,'DV - P'!$Z$1:$Z$50))","v":1},{"$f":"IF($C9=\"\",\"\",TEST!$F$5)","v":0},{"$f":"IF($C9=\"\",\"\",TEST!$J$5)","v":1},null,{"$f":"IF($C9=\"\",\"\",SUM(F9,H9,J9,L9))","v":4},null,{"$f":"IF($C9=\"\",\"\",MATCH($C9,Výsledky!$K$8:$K$57,0))","v":2}]
[null,null,null,{"$f":"IF(Start!$E$7=\"\",\"\",Start!$E$7)","v":"Dlažov"},{"$f":"IF(Start!$F$7=\"\",\"\",Start!$F$7)","v":"KT"},null,{"$f":"IF($C9=\"\",\"\",'PJ-V'!$O5)","v":20.440000000000001},null,{"$f":"IF($C9=\"\",\"\",'DV-V'!$O5)","v":"DNF"}]
[null,{"$f":"Start!$C8","v":2},{"$f":"IF(Start!$D8=\"\",\"\",Start!$D8)","v":"Tereza Grünerová "},{"$f":"IF(Start!$E$8=\"\",\"\",Start!$E$8)","v":"Brod nad Tichou"},{"$f":"IF(Start!$F$8=\"\",\"\",Start!$F$8)","v":"TA"},{"$f":"IF($C11=\"\",\"\",IF(V.l.ZPV!$C$6=\"\",\"0\",IF(ISNA(MATCH($C11,ZPVOblN,0)),COUNTIF(ZPVOblT,\".\")+1,LOOKUP($C11,ZPVOblN,ZPVOblD))))","v":"0"},{"$f":"IF($C11=\"\",\"\",'PJ-V'!$J6)","v":32.08},{"$f":"IF($C11=\"\",\"\",LOOKUP($C11,'PJ - P'!$Y$1:$Y$50,'PJ - P'!$Z$1:$Z$50))","v":5},{"$f":"IF($C11=\"\",\"\",'DV-V'!$J6)","v":"DNF"},{"$f":"IF($C11=\"\",\"\",LOOKUP($C11,'DV - P'!$Y$1:$Y$50,'DV - P'!$Z$1:$Z$50))","v":1},{"$f":"IF($C11=\"\",\"\",TEST!$F$6)","v":0},{"$f":"IF($C11=\"\",\"\",TEST!$J$6)","v":1},null,{"$f":"IF($C11=\"\",\"\",SUM(F11,H11,J11,L11))","v":7},null,{"$f":"IF($C11=\"\",\"\",MATCH($C11,Výsledky!$K$8:$K$57,0))","v":4}]
[null,null,null,{"$f":"IF(Start!$E$8=\"\",\"\",Start!$E$8)","v":"Brod nad Tichou"},{"$f":"IF(Start!$F$8=\"\",\"\",Start!$F$8)","v":"TA"},null,{"$f":"IF($C11=\"\",\"\",'PJ-V'!$O6)","v":"NP"},null,{"$f":"IF($C11=\"\",\"\",'DV-V'!$O6)","v":"DNF"}]
[null,{"$f":"Start!$C9","v":3},{"$f":"IF(Start!$D9=\"\",\"\",Start!$D9)","v":"Iva Babková"},{"$f":"IF(Start!$E$9=\"\",\"\",Start!$E$9)","v":"Bystřice nad Úhlavou"},{"$f":"IF(Start!$F$9=\"\",\"\",Start!$F$9)","v":"KT"},{"$f":"IF($C13=\"\",\"\",IF(V.l.ZPV!$C$6=\"\",\"0\",IF(ISNA(MATCH($C13,ZPVOblN,0)),COUNTIF(ZPVOblT,\".\")+1,LOOKUP($C13,ZPVOblN,ZPVOblD))))","v":"0"},{"$f":"IF($C13=\"\",\"\",'PJ-V'!$J7)","v":22.33},{"$f":"IF($C13=\"\",\"\",LOOKUP($C13,'PJ - P'!$Y$1:$Y$50,'PJ - P'!$Z$1:$Z$50))","v":1},{"$f":"IF($C13=\"\",\"\",'DV-V'!$J7)","v":"DNF"},{"$f":"IF($C13=\"\",\"\",LOOKUP($C13,'DV - P'!$Y$1:$Y$50,'DV - P'!$Z$1:$Z$50))","v":1},{"$f":"IF($C13=\"\",\"\",TEST!$F$7)","v":0},{"$f":"IF($C13=\"\",\"\",TEST!$J$7)","v":1},null,{"$f":"IF($C13=\"\",\"\",SUM(F13,H13,J13,L13))","v":3},null,{"$f":"IF($C13=\"\",\"\",MATCH($C13,Výsledky!$K$8:$K$57,0))","v":1}]
[null,null,null,{"$f":"IF(Start!$E$9=\"\",\"\",Start!$E$9)","v":"Bystřice nad Úhlavou"},{"$f":"IF(Start!$F$9=\"\",\"\",Start!$F$9)","v":"KT"},null,{"$f":"IF($C13=\"\",\"\",'PJ-V'!$O7)","v":19.28},null,{"$f":"IF($C13=\"\",\"\",'DV-V'!$O7)","v":"DNF"}]
[null,{"$f":"Start!$C10","v":4},{"$f":"IF(Start!$D10=\"\",\"\",Start!$D10)","v":"Michaela Marešová"},{"$f":"IF(Start!$E$10=\"\",\"\",Start!$E$10)","v":"Planá"},{"$f":"IF(Start!$F$10=\"\",\"\",Start!$F$10)","v":"TA"},{"$f":"IF($C15=\"\",\"\",IF(V.l.ZPV!$C$6=\"\",\"0\",IF(ISNA(MATCH($C15,ZPVOblN,0)),COUNTIF(ZPVOblT,\".\")+1,LOOKUP($C15,ZPVOblN,ZPVOblD))))","v":"0"},{"$f":"IF($C15=\"\",\"\",'PJ-V'!$J8)","v":30.94},{"$f":"IF($C15=\"\",\"\",LOOKUP($C15,'PJ - P'!$Y$1:$Y$50,'PJ - P'!$Z$1:$Z$50))","v":3},{"$f":"IF($C15=\"\",\"\",'DV-V'!$J8)","v":"DNF"},{"$f":"IF($C15=\"\",\"\",LOOKUP($C15,'DV - P'!$Y$1:$Y$50,'DV - P'!$Z$1:$Z$50))","v":1},{"$f":"IF($C15=\"\",\"\",TEST!$F$8)","v":0},{"$f":"IF($C15=\"\",\"\",TEST!$J$8)","v":1},null,{"$f":"IF($C15=\"\",\"\",SUM(F15,H15,J15,L15))","v":5},null,{"$f":"IF($C15=\"\",\"\",MATCH($C15,Výsledky!$K$8:$K$57,0))","v":3}]
[null,null,null,{"$f":"IF(Start!$E$10=\"\",\"\",Start!$E$10)","v":"Planá"},{"$f":"IF(Start!$F$10=\"\",\"\",Start!$F$10)","v":"TA"},null,{"$f":"IF($C15=\"\",\"\",'PJ-V'!$O8)","v":23.66},null,{"$f":"IF($C15=\"\",\"\",'DV-V'!$O8)","v":"DNF"}]
[null,{"$f":"Start!$C11","v":5},{"$f":"IF(Start!$D11=\"\",\"\",Start!$D11)","v":"Adéla Stodolová"},{"$f":"IF(Start!$E$11=\"\",\"\",Start!$E$11)","v":"Planá"},{"$f":"IF(Start!$F$11=\"\",\"\",Start!$F$11)","v":"TA"},{"$f":"IF($C17=\"\",\"\",IF(V.l.ZPV!$C$6=\"\",\"0\",IF(ISNA(MATCH($C17,ZPVOblN,0)),COUNTIF(ZPVOblT,\".\")+1,LOOKUP($C17,ZPVOblN,ZPVOblD))))","v":"0"},{"$f":"IF($C17=\"\",\"\",'PJ-V'!$J9)","v":29.29},{"$f":"IF($C17=\"\",\"\",LOOKUP($C17,'PJ - P'!$Y$1:$Y$50,'PJ - P'!$Z$1:$Z$50))","v":4},{"$f":"IF($C17=\"\",\"\",'DV-V'!$J9)","v":"DNF"},{"$f":"IF($C17=\"\",\"\",LOOKUP($C17,'DV - P'!$Y$1:$Y$50,'DV - P'!$Z$1:$Z$50))","v":1},{"$f":"IF($C17=\"\",\"\",TEST!$F$9)","v":1},{"$f":"IF($C17=\"\",\"\",TEST!$J$9)","v":5},null,{"$f":"IF($C17=\"\",\"\",SUM(F17,H17,J17,L17))","v":10},null,{"$f":"IF($C17=\"\",\"\",MATCH($C17,Výsledky!$K$8:$K$57,0))","v":5}]
[null,null,null,{"$f":"IF(Start!$E$11=\"\",\"\",Start!$E$11)","v":"Planá"},{"$f":"IF(Start!$F$11=\"\",\"\",Start!$F$11)","v":"TA"},null,{"$f":"IF($C17=\"\",\"\",'PJ-V'!$O9)","v":31.11},null,{"$f":"IF($C17=\"\",\"\",'DV-V'!$O9)","v":"DNF"}]
[null,{"$f":"Start!$C12","v":6},{"$f":"IF(Start!$D12=\"\",\"\",Start!$D12)","v":""},{"$f":"IF(Start!$E$12=\"\",\"\",Start!$E$12)","v":""},{"$f":"IF(Start!$F$12=\"\",\"\",Start!$F$12)","v":""},{"$f":"IF($C19=\"\",\"\",IF(V.l.ZPV!$C$6=\"\",\"0\",IF(ISNA(MATCH($C19,ZPVOblN,0)),COUNTIF(ZPVOblT,\".\")+1,LOOKUP($C19,ZPVOblN,ZPVOblD))))","v":""},{"$f":"IF($C19=\"\",\"\",'PJ-V'!$J10)","v":""},{"$f":"IF($C19=\"\",\"\",LOOKUP($C19,'PJ - P'!$Y$1:$Y$50,'PJ - P'!$Z$1:$Z$50))","v":""},{"$f":"IF($C19=\"\",\"\",'DV-V'!$J10)","v":""},{"$f":"IF($C19=\"\",\"\",LOOKUP($C19,'DV - P'!$Y$1:$Y$50,'DV - P'!$Z$1:$Z$50))","v":""},{"$f":"IF($C19=\"\",\"\",TEST!$F$10)","v":""},{"$f":"IF($C19=\"\",\"\",TEST!$J$10)","v":""},null,{"$f":"IF($C19=\"\",\"\",SUM(F19,H19,J19,L19))","v":""},null,{"$f":"IF($C19=\"\",\"\",MATCH($C19,Výsledky!$K$8:$K$57,0))","v":""}]
[null,null,null,{"$f":"IF(Start!$E$12=\"\",\"\",Start!$E$12)","v":""},{"$f":"IF(Start!$F$12=\"\",\"\",Start!$F$12)","v":""},null,{"$f":"IF($C19=\"\",\"\",'PJ-V'!$O10)","v":""},null,{"$f":"IF($C19=\"\",\"\",'DV-V'!$O10)","v":""}]
[null,{"$f":"Start!$C13","v":7},{"$f":"IF(Start!$D13=\"\",\"\",Start!$D13)","v":""},{"$f":"IF(Start!$E$13=\"\",\"\",Start!$E$13)","v":""},{"$f":"IF(Start!$F$13=\"\",\"\",Start!$F$13)","v":""},{"$f":"IF($C21=\"\",\"\",IF(V.l.ZPV!$C$6=\"\",\"0\",IF(ISNA(MATCH($C21,ZPVOblN,0)),COUNTIF(ZPVOblT,\".\")+1,LOOKUP($C21,ZPVOblN,ZPVOblD))))","v":""},{"$f":"IF($C21=\"\",\"\",'PJ-V'!$J11)","v":""},{"$f":"IF($C21=\"\",\"\",LOOKUP($C21,'PJ - P'!$Y$1:$Y$50,'PJ - P'!$Z$1:$Z$50))","v":""},{"$f":"IF($C21=\"\",\"\",'DV-V'!$J11)","v":""},{"$f":"IF($C21=\"\",\"\",LOOKUP($C21,'DV - P'!$Y$1:$Y$50,'DV - P'!$Z$1:$Z$50))","v":""},{"$f":"IF($C21=\"\",\"\",TEST!$F$11)","v":""},{"$f":"IF($C21=\"\",\"\",TEST!$J$11)","v":""},null,{"$f":"IF($C21=\"\",\"\",SUM(F21,H21,J21,L21))","v":""},null,{"$f":"IF($C21=\"\",\"\",MATCH($C21,Výsledky!$K$8:$K$57,0))","v":""}]
[null,null,null,{"$f":"IF(Start!$E$13=\"\",\"\",Start!$E$13)","v":""},{"$f":"IF(Start!$F$13=\"\",\"\",Start!$F$13)","v":""},null,{"$f":"IF($C21=\"\",\"\",'PJ-V'!$O11)","v":""},null,{"$f":"IF($C21=\"\",\"\",'DV-V'!$O11)","v":""}]
[null,{"$f":"Start!$C14","v":8},{"$f":"IF(Start!$D14=\"\",\"\",Start!$D14)","v":""},{"$f":"IF(Start!$E$14=\"\",\"\",Start!$E$14)","v":""},{"$f":"IF(Start!$F$14=\"\",\"\",Start!$F$14)","v":""},{"$f":"IF($C23=\"\",\"\",IF(V.l.ZPV!$C$6=\"\",\"0\",IF(ISNA(MATCH($C23,ZPVOblN,0)),COUNTIF(ZPVOblT,\".\")+1,LOOKUP($C23,ZPVOblN,ZPVOblD))))","v":""},{"$f":"IF($C23=\"\",\"\",'PJ-V'!$J12)","v":""},{"$f":"IF($C23=\"\",\"\",LOOKUP($C23,'PJ - P'!$Y$1:$Y$50,'PJ - P'!$Z$1:$Z$50))","v":""},{"$f":"IF($C23=\"\",\"\",'DV-V'!$J12)","v":""},{"$f":"IF($C23=\"\",\"\",LOOKUP($C23,'DV - P'!$Y$1:$Y$50,'DV - P'!$Z$1:$Z$50))","v":""},{"$f":"IF($C23=\"\",\"\",TEST!$F$12)","v":""},{"$f":"IF($C23=\"\",\"\",TEST!$J$12)","v":""},null,{"$f":"IF($C23=\"\",\"\",SUM(F23,H23,J23,L23))","v":""},null,{"$f":"IF($C23=\"\",\"\",MATCH($C23,Výsledky!$K$8:$K$57,0))","v":""}]
[null,null,null,{"$f":"IF(Start!$E$14=\"\",\"\",Start!$E$14)","v":""},{"$f":"IF(Start!$F$14=\"\",\"\",Start!$F$14)","v":""},null,{"$f":"IF($C23=\"\",\"\",'PJ-V'!$O12)","v":""},null,{"$f":"IF($C23=\"\",\"\",'DV-V'!$O12)","v":""}]
[null,{"$f":"Start!$C15","v":9},{"$f":"IF(Start!$D15=\"\",\"\",Start!$D15)","v":""},{"$f":"IF(Start!$E$15=\"\",\"\",Start!$E$15)","v":""},{"$f":"IF(Start!$F$15=\"\",\"\",Start!$F$15)","v":""},{"$f":"IF($C25=\"\",\"\",IF(V.l.ZPV!$C$6=\"\",\"0\",IF(ISNA(MATCH($C25,ZPVOblN,0)),COUNTIF(ZPVOblT,\".\")+1,LOOKUP($C25,ZPVOblN,ZPVOblD))))","v":""},{"$f":"IF($C25=\"\",\"\",'PJ-V'!$J13)","v":""},{"$f":"IF($C25=\"\",\"\",LOOKUP($C25,'PJ - P'!$Y$1:$Y$50,'PJ - P'!$Z$1:$Z$50))","v":""},{"$f":"IF($C25=\"\",\"\",'DV-V'!$J13)","v":""},{"$f":"IF($C25=\"\",\"\",LOOKUP($C25,'DV - P'!$Y$1:$Y$50,'DV - P'!$Z$1:$Z$50))","v":""},{"$f":"IF($C25=\"\",\"\",TEST!$F$13)","v":""},{"$f":"IF($C25=\"\",\"\",TEST!$J$13)","v":""},null,{"$f":"IF($C25=\"\",\"\",SUM(F25,H25,J25,L25))","v":""},null,{"$f":"IF($C25=\"\",\"\",MATCH($C25,Výsledky!$K$8:$K$57,0))","v":""}]
[null,null,null,{"$f":"IF(Start!$E$15=\"\",\"\",Start!$E$15)","v":""},{"$f":"IF(Start!$F$15=\"\",\"\",Start!$F$15)","v":""},null,{"$f":"IF($C25=\"\",\"\",'PJ-V'!$O13)","v":""},null,{"$f":"IF($C25=\"\",\"\",'DV-V'!$O13)","v":""}]
[null,{"$f":"Start!$C16","v":10},{"$f":"IF(Start!$D16=\"\",\"\",Start!$D16)","v":""},{"$f":"IF(Start!$E$16=\"\",\"\",Start!$E$16)","v":""},{"$f":"IF(Start!$F$16=\"\",\"\",Start!$F$16)","v":""},{"$f":"IF($C27=\"\",\"\",IF(V.l.ZPV!$C$6=\"\",\"0\",IF(ISNA(MATCH($C27,ZPVOblN,0)),COUNTIF(ZPVOblT,\".\")+1,LOOKUP($C27,ZPVOblN,ZPVOblD))))","v":""},{"$f":"IF($C27=\"\",\"\",'PJ-V'!$J14)","v":""},{"$f":"IF($C27=\"\",\"\",LOOKUP($C27,'PJ - P'!$Y$1:$Y$50,'PJ - P'!$Z$1:$Z$50))","v":""},{"$f":"IF($C27=\"\",\"\",'DV-V'!$J14)","v":""},{"$f":"IF($C27=\"\",\"\",LOOKUP($C27,'DV - P'!$Y$1:$Y$50,'DV - P'!$Z$1:$Z$50))","v":""},{"$f":"IF($C27=\"\",\"\",TEST!$F$14)","v":""},{"$f":"IF($C27=\"\",\"\",TEST!$J$14)","v":""},null,{"$f":"IF($C27=\"\",\"\",SUM(F27,H27,J27,L27))","v":""},null,{"$f":"IF($C27=\"\",\"\",MATCH($C27,Výsledky!$K$8:$K$57,0))","v":""}]
[null,null,null,{"$f":"IF(Start!$E$16=\"\",\"\",Start!$E$16)","v":""},{"$f":"IF(Start!$F$16=\"\",\"\",Start!$F$16)","v":""},null,{"$f":"IF($C27=\"\",\"\",'PJ-V'!$O14)","v":""},null,{"$f":"IF($C27=\"\",\"\",'DV-V'!$O14)","v":""}]
[null,{"$f":"Start!$C17","v":11},{"$f":"IF(Start!$D17=\"\",\"\",Start!$D17)","v":""},{"$f":"IF(Start!$E$17=\"\",\"\",Start!$E$17)","v":""},{"$f":"IF(Start!$F$17=\"\",\"\",Start!$F$17)","v":""},{"$f":"IF($C29=\"\",\"\",IF(V.l.ZPV!$C$6=\"\",\"0\",IF(ISNA(MATCH($C29,ZPVOblN,0)),COUNTIF(ZPVOblT,\".\")+1,LOOKUP($C29,ZPVOblN,ZPVOblD))))","v":""},{"$f":"IF($C29=\"\",\"\",'PJ-V'!$J15)","v":""},{"$f":"IF($C29=\"\",\"\",LOOKUP($C29,'PJ - P'!$Y$1:$Y$50,'PJ - P'!$Z$1:$Z$50))","v":""},{"$f":"IF($C29=\"\",\"\",'DV-V'!$J15)","v":""},{"$f":"IF($C29=\"\",\"\",LOOKUP($C29,'DV - P'!$Y$1:$Y$50,'DV - P'!$Z$1:$Z$50))","v":""},{"$f":"IF($C29=\"\",\"\",TEST!$F$15)","v":""},{"$f":"IF($C29=\"\",\"\",TEST!$J$15)","v":""},null,{"$f":"IF($C29=\"\",\"\",SUM(F29,H29,J29,L29))","v":""},null,{"$f":"IF($C29=\"\",\"\",MATCH($C29,Výsledky!$K$8:$K$57,0))","v":""}]
[null,null,null,{"$f":"IF(Start!$E$17=\"\",\"\",Start!$E$17)","v":""},{"$f":"IF(Start!$F$17=\"\",\"\",Start!$F$17)","v":""},null,{"$f":"IF($C29=\"\",\"\",'PJ-V'!$O15)","v":""},null,{"$f":"IF($C29=\"\",\"\",'DV-V'!$O15)","v":""}]
[null,{"$f":"Start!$C18","v":12},{"$f":"IF(Start!$D18=\"\",\"\",Start!$D18)","v":""},{"$f":"IF(Start!$E$18=\"\",\"\",Start!$E$18)","v":""},{"$f":"IF(Start!$F$18=\"\",\"\",Start!$F$18)","v":""},{"$f":"IF($C31=\"\",\"\",IF(V.l.ZPV!$C$6=\"\",\"0\",IF(ISNA(MATCH($C31,ZPVOblN,0)),COUNTIF(ZPVOblT,\".\")+1,LOOKUP($C31,ZPVOblN,ZPVOblD))))","v":""},{"$f":"IF($C31=\"\",\"\",'PJ-V'!$J16)","v":""},{"$f":"IF($C31=\"\",\"\",LOOKUP($C31,'PJ - P'!$Y$1:$Y$50,'PJ - P'!$Z$1:$Z$50))","v":""},{"$f":"IF($C31=\"\",\"\",'DV-V'!$J16)","v":""},{"$f":"IF($C31=\"\",\"\",LOOKUP($C31,'DV - P'!$Y$1:$Y$50,'DV - P'!$Z$1:$Z$50))","v":""},{"$f":"IF($C31=\"\",\"\",TEST!$F$16)","v":""},{"$f":"IF($C31=\"\",\"\",TEST!$J$16)","v":""},null,{"$f":"IF($C31=\"\",\"\",SUM(F31,H31,J31,L31))","v":""},null,{"$f":"IF($C31=\"\",\"\",MATCH($C31,Výsledky!$K$8:$K$57,0))","v":""}]
[null,null,null,{"$f":"IF(Start!$E$18=\"\",\"\",Start!$E$18)","v":""},{"$f":"IF(Start!$F$18=\"\",\"\",Start!$F$18)","v":""},null,{"$f":"IF($C31=\"\",\"\",'PJ-V'!$O16)","v":""},null,{"$f":"IF($C31=\"\",\"\",'DV-V'!$O16)","v":""}]
[null,{"$f":"Start!$C19","v":13},{"$f":"IF(Start!$D19=\"\",\"\",Start!$D19)","v":""},{"$f":"IF(Start!$E$19=\"\",\"\",Start!$E$19)","v":""},{"$f":"IF(Start!$F$19=\"\",\"\",Start!$F$19)","v":""},{"$f":"IF($C33=\"\",\"\",IF(V.l.ZPV!$C$6=\"\",\"0\",IF(ISNA(MATCH($C33,ZPVOblN,0)),COUNTIF(ZPVOblT,\".\")+1,LOOKUP($C33,ZPVOblN,ZPVOblD))))","v":""},{"$f":"IF($C33=\"\",\"\",'PJ-V'!$J17)","v":""},{"$f":"IF($C33=\"\",\"\",LOOKUP($C33,'PJ - P'!$Y$1:$Y$50,'PJ - P'!$Z$1:$Z$50))","v":""},{"$f":"IF($C33=\"\",\"\",'DV-V'!$J17)","v":""},{"$f":"IF($C33=\"\",\"\",LOOKUP($C33,'DV - P'!$Y$1:$Y$50,'DV - P'!$Z$1:$Z$50))","v":""},{"$f":"IF($C33=\"\",\"\",TEST!$F$17)","v":""},{"$f":"IF($C33=\"\",\"\",TEST!$J$17)","v":""},null,{"$f":"IF($C33=\"\",\"\",SUM(F33,H33,J33,L33))","v":""},null,{"$f":"IF($C33=\"\",\"\",MATCH($C33,Výsledky!$K$8:$K$57,0))","v":""}]
[null,null,null,{"$f":"IF(Start!$E$19=\"\",\"\",Start!$E$19)","v":""},{"$f":"IF(Start!$F$19=\"\",\"\",Start!$F$19)","v":""},null,{"$f":"IF($C33=\"\",\"\",'PJ-V'!$O17)","v":""},null,{"$f":"IF($C33=\"\",\"\",'DV-V'!$O17)","v":""}]
[null,{"$f":"Start!$C20","v":14},{"$f":"IF(Start!$D20=\"\",\"\",Start!$D20)","v":""},{"$f":"IF(Start!$E$20=\"\",\"\",Start!$E$20)","v":""},{"$f":"IF(Start!$F$20=\"\",\"\",Start!$F$20)","v":""},{"$f":"IF($C35=\"\",\"\",IF(V.l.ZPV!$C$6=\"\",\"0\",IF(ISNA(MATCH($C35,ZPVOblN,0)),COUNTIF(ZPVOblT,\".\")+1,LOOKUP($C35,ZPVOblN,ZPVOblD))))","v":""},{"$f":"IF($C35=\"\",\"\",'PJ-V'!$J18)","v":""},{"$f":"IF($C35=\"\",\"\",LOOKUP($C35,'PJ - P'!$Y$1:$Y$50,'PJ - P'!$Z$1:$Z$50))","v":""},{"$f":"IF($C35=\"\",\"\",'DV-V'!$J18)","v":""},{"$f":"IF($C35=\"\",\"\",LOOKUP($C35,'DV - P'!$Y$1:$Y$50,'DV - P'!$Z$1:$Z$50))","v":""},{"$f":"IF($C35=\"\",\"\",TEST!$F$18)","v":""},{"$f":"IF($C35=\"\",\"\",TEST!$J$18)","v":""},null,{"$f":"IF($C35=\"\",\"\",SUM(F35,H35,J35,L35))","v":""},null,{"$f":"IF($C35=\"\",\"\",MATCH($C35,Výsledky!$K$8:$K$57,0))","v":""}]
[null,null,null,{"$f":"IF(Start!$E$20=\"\",\"\",Start!$E$20)","v":""},{"$f":"IF(Start!$F$20=\"\",\"\",Start!$F$20)","v":""},null,{"$f":"IF($C35=\"\",\"\",'PJ-V'!$O18)","v":""},null,{"$f":"IF($C35=\"\",\"\",'DV-V'!$O18)","v":""}]
[null,{"$f":"Start!$C21","v":15},{"$f":"IF(Start!$D21=\"\",\"\",Start!$D21)","v":""},{"$f":"IF(Start!$E$21=\"\",\"\",Start!$E$21)","v":""},{"$f":"IF(Start!$F$21=\"\",\"\",Start!$F$21)","v":""},{"$f":"IF($C37=\"\",\"\",IF(V.l.ZPV!$C$6=\"\",\"0\",IF(ISNA(MATCH($C37,ZPVOblN,0)),COUNTIF(ZPVOblT,\".\")+1,LOOKUP($C37,ZPVOblN,ZPVOblD))))","v":""},{"$f":"IF($C37=\"\",\"\",'PJ-V'!$J19)","v":""},{"$f":"IF($C37=\"\",\"\",LOOKUP($C37,'PJ - P'!$Y$1:$Y$50,'PJ - P'!$Z$1:$Z$50))","v":""},{"$f":"IF($C37=\"\",\"\",'DV-V'!$J19)","v":""},{"$f":"IF($C37=\"\",\"\",LOOKUP($C37,'DV - P'!$Y$1:$Y$50,'DV - P'!$Z$1:$Z$50))","v":""},{"$f":"IF($C37=\"\",\"\",TEST!$F$19)","v":""},{"$f":"IF($C37=\"\",\"\",TEST!$J$19)","v":""},null,{"$f":"IF($C37=\"\",\"\",SUM(F37,H37,J37,L37))","v":""},null,{"$f":"IF($C37=\"\",\"\",MATCH($C37,Výsledky!$K$8:$K$57,0))","v":""}]
[null,null,null,{"$f":"IF(Start!$E$21=\"\",\"\",Start!$E$21)","v":""},{"$f":"IF(Start!$F$21=\"\",\"\",Start!$F$21)","v":""},null,{"$f":"IF($C37=\"\",\"\",'PJ-V'!$O19)","v":""},null,{"$f":"IF($C37=\"\",\"\",'DV-V'!$O19)","v":""}]
[null,{"$f":"Start!$C22","v":16},{"$f":"IF(Start!$D22=\"\",\"\",Start!$D22)","v":""},{"$f":"IF(Start!$E$22=\"\",\"\",Start!$E$22)","v":""},{"$f":"IF(Start!$F$22=\"\",\"\",Start!$F$22)","v":""},{"$f":"IF($C39=\"\",\"\",IF(V.l.ZPV!$C$6=\"\",\"0\",IF(ISNA(MATCH($C39,ZPVOblN,0)),COUNTIF(ZPVOblT,\".\")+1,LOOKUP($C39,ZPVOblN,ZPVOblD))))","v":""},{"$f":"IF($C39=\"\",\"\",'PJ-V'!$J20)","v":""},{"$f":"IF($C39=\"\",\"\",LOOKUP($C39,'PJ - P'!$Y$1:$Y$50,'PJ - P'!$Z$1:$Z$50))","v":""},{"$f":"IF($C39=\"\",\"\",'DV-V'!$J20)","v":""},{"$f":"IF($C39=\"\",\"\",LOOKUP($C39,'DV - P'!$Y$1:$Y$50,'DV - P'!$Z$1:$Z$50))","v":""},{"$f":"IF($C39=\"\",\"\",TEST!$F$20)","v":""},{"$f":"IF($C39=\"\",\"\",TEST!$J$20)","v":""},null,{"$f":"IF($C39=\"\",\"\",SUM(F39,H39,J39,L39))","v":""},null,{"$f":"IF($C39=\"\",\"\",MATCH($C39,Výsledky!$K$8:$K$57,0))","v":""}]
[null,null,null,{"$f":"IF(Start!$E$22=\"\",\"\",Start!$E$22)","v":""},{"$f":"IF(Start!$F$22=\"\",\"\",Start!$F$22)","v":""},null,{"$f":"IF($C39=\"\",\"\",'PJ-V'!$O20)","v":""},null,{"$f":"IF($C39=\"\",\"\",'DV-V'!$O20)","v":""}]
[null,{"$f":"Start!$C23","v":17},{"$f":"IF(Start!$D23=\"\",\"\",Start!$D23)","v":""},{"$f":"IF(Start!$E$23=\"\",\"\",Start!$E$23)","v":""},{"$f":"IF(Start!$F$23=\"\",\"\",Start!$F$23)","v":""},{"$f":"IF($C41=\"\",\"\",IF(V.l.ZPV!$C$6=\"\",\"0\",IF(ISNA(MATCH($C41,ZPVOblN,0)),COUNTIF(ZPVOblT,\".\")+1,LOOKUP($C41,ZPVOblN,ZPVOblD))))","v":""},{"$f":"IF($C41=\"\",\"\",'PJ-V'!$J21)","v":""},{"$f":"IF($C41=\"\",\"\",LOOKUP($C41,'PJ - P'!$Y$1:$Y$50,'PJ - P'!$Z$1:$Z$50))","v":""},{"$f":"IF($C41=\"\",\"\",'DV-V'!$J21)","v":""},{"$f":"IF($C41=\"\",\"\",LOOKUP($C41,'DV - P'!$Y$1:$Y$50,'DV - P'!$Z$1:$Z$50))","v":""},{"$f":"IF($C41=\"\",\"\",TEST!$F$21)","v":""},{"$f":"IF($C41=\"\",\"\",TEST!$J$21)","v":""},null,{"$f":"IF($C41=\"\",\"\",SUM(F41,H41,J41,L41))","v":""},null,{"$f":"IF($C41=\"\",\"\",MATCH($C41,Výsledky!$K$8:$K$57,0))","v":""}]
[null,null,null,{"$f":"IF(Start!$E$23=\"\",\"\",Start!$E$23)","v":""},{"$f":"IF(Start!$F$23=\"\",\"\",Start!$F$23)","v":""},null,{"$f":"IF($C41=\"\",\"\",'PJ-V'!$O21)","v":""},null,{"$f":"IF($C41=\"\",\"\",'DV-V'!$O21)","v":""}]
[null,{"$f":"Start!$C24","v":18},{"$f":"IF(Start!$D24=\"\",\"\",Start!$D24)","v":""},{"$f":"IF(Start!$E$24=\"\",\"\",Start!$E$24)","v":""},{"$f":"IF(Start!$F$24=\"\",\"\",Start!$F$24)","v":""},{"$f":"IF($C43=\"\",\"\",IF(V.l.ZPV!$C$6=\"\",\"0\",IF(ISNA(MATCH($C43,ZPVOblN,0)),COUNTIF(ZPVOblT,\".\")+1,LOOKUP($C43,ZPVOblN,ZPVOblD))))","v":""},{"$f":"IF($C43=\"\",\"\",'PJ-V'!$J22)","v":""},{"$f":"IF($C43=\"\",\"\",LOOKUP($C43,'PJ - P'!$Y$1:$Y$50,'PJ - P'!$Z$1:$Z$50))","v":""},{"$f":"IF($C43=\"\",\"\",'DV-V'!$J22)","v":""},{"$f":"IF($C43=\"\",\"\",LOOKUP($C43,'DV - P'!$Y$1:$Y$50,'DV - P'!$Z$1:$Z$50))","v":""},{"$f":"IF($C43=\"\",\"\",TEST!$F$22)","v":""},{"$f":"IF($C43=\"\",\"\",TEST!$J$22)","v":""},null,{"$f":"IF($C43=\"\",\"\",SUM(F43,H43,J43,L43))","v":""},null,{"$f":"IF($C43=\"\",\"\",MATCH($C43,Výsledky!$K$8:$K$57,0))","v":""}]
[null,null,null,{"$f":"IF(Start!$E$24=\"\",\"\",Start!$E$24)","v":""},{"$f":"IF(Start!$F$24=\"\",\"\",Start!$F$24)","v":""},null,{"$f":"IF($C43=\"\",\"\",'PJ-V'!$O22)","v":""},null,{"$f":"IF($C43=\"\",\"\",'DV-V'!$O22)","v":""}]
[null,{"$f":"Start!$C25","v":19},{"$f":"IF(Start!$D25=\"\",\"\",Start!$D25)","v":""},{"$f":"IF(Start!$E$25=\"\",\"\",Start!$E$25)","v":""},{"$f":"IF(Start!$F$25=\"\",\"\",Start!$F$25)","v":""},{"$f":"IF($C45=\"\",\"\",IF(V.l.ZPV!$C$6=\"\",\"0\",IF(ISNA(MATCH($C45,ZPVOblN,0)),COUNTIF(ZPVOblT,\".\")+1,LOOKUP($C45,ZPVOblN,ZPVOblD))))","v":""},{"$f":"IF($C45=\"\",\"\",'PJ-V'!$J23)","v":""},{"$f":"IF($C45=\"\",\"\",LOOKUP($C45,'PJ - P'!$Y$1:$Y$50,'PJ - P'!$Z$1:$Z$50))","v":""},{"$f":"IF($C45=\"\",\"\",'DV-V'!$J23)","v":""},{"$f":"IF($C45=\"\",\"\",LOOKUP($C45,'DV - P'!$Y$1:$Y$50,'DV - P'!$Z$1:$Z$50))","v":""},{"$f":"IF($C45=\"\",\"\",TEST!$F$23)","v":""},{"$f":"IF($C45=\"\",\"\",TEST!$J$23)","v":""},null,{"$f":"IF($C45=\"\",\"\",SUM(F45,H45,J45,L45))","v":""},null,{"$f":"IF($C45=\"\",\"\",MATCH($C45,Výsledky!$K$8:$K$57,0))","v":""}]
[null,null,null,{"$f":"IF(Start!$E$25=\"\",\"\",Start!$E$25)","v":""},{"$f":"IF(Start!$F$25=\"\",\"\",Start!$F$25)","v":""},null,{"$f":"IF($C45=\"\",\"\",'PJ-V'!$O23)","v":""},null,{"$f":"IF($C45=\"\",\"\",'DV-V'!$O23)","v":""}]
[null,{"$f":"Start!$C26","v":20},{"$f":"IF(Start!$D26=\"\",\"\",Start!$D26)","v":""},{"$f":"IF(Start!$E$26=\"\",\"\",Start!$E$26)","v":""},{"$f":"IF(Start!$F$26=\"\",\"\",Start!$F$26)","v":""},{"$f":"IF($C47=\"\",\"\",IF(V.l.ZPV!$C$6=\"\",\"0\",IF(ISNA(MATCH($C47,ZPVOblN,0)),COUNTIF(ZPVOblT,\".\")+1,LOOKUP($C47,ZPVOblN,ZPVOblD))))","v":""},{"$f":"IF($C47=\"\",\"\",'PJ-V'!$J24)","v":""},{"$f":"IF($C47=\"\",\"\",LOOKUP($C47,'PJ - P'!$Y$1:$Y$50,'PJ - P'!$Z$1:$Z$50))","v":""},{"$f":"IF($C47=\"\",\"\",'DV-V'!$J24)","v":""},{"$f":"IF($C47=\"\",\"\",LOOKUP($C47,'DV - P'!$Y$1:$Y$50,'DV - P'!$Z$1:$Z$50))","v":""},{"$f":"IF($C47=\"\",\"\",TEST!$F$24)","v":""},{"$f":"IF($C47=\"\",\"\",TEST!$J$24)","v":""},null,{"$f":"IF($C47=\"\",\"\",SUM(F47,H47,J47,L47))","v":""},null,{"$f":"IF($C47=\"\",\"\",MATCH($C47,Výsledky!$K$8:$K$57,0))","v":""}]
[null,null,null,{"$f":"IF(Start!$E$26=\"\",\"\",Start!$E$26)","v":""},{"$f":"IF(Start!$F$26=\"\",\"\",Start!$F$26)","v":""},null,{"$f":"IF($C47=\"\",\"\",'PJ-V'!$O24)","v":""},null,{"$f":"IF($C47=\"\",\"\",'DV-V'!$O24)","v":""}]
[null,{"$f":"Start!$C27","v":21},{"$f":"IF(Start!$D27=\"\",\"\",Start!$D27)","v":""},{"$f":"IF(Start!$E$27=\"\",\"\",Start!$E$27)","v":""},{"$f":"IF(Start!$F$27=\"\",\"\",Start!$F$27)","v":""},{"$f":"IF($C49=\"\",\"\",IF(V.l.ZPV!$C$6=\"\",\"0\",IF(ISNA(MATCH($C49,ZPVOblN,0)),COUNTIF(ZPVOblT,\".\")+1,LOOKUP($C49,ZPVOblN,ZPVOblD))))","v":""},{"$f":"IF($C49=\"\",\"\",'PJ-V'!$J25)","v":""},{"$f":"IF($C49=\"\",\"\",LOOKUP($C49,'PJ - P'!$Y$1:$Y$50,'PJ - P'!$Z$1:$Z$50))","v":""},{"$f":"IF($C49=\"\",\"\",'DV-V'!$J25)","v":""},{"$f":"IF($C49=\"\",\"\",LOOKUP($C49,'DV - P'!$Y$1:$Y$50,'DV - P'!$Z$1:$Z$50))","v":""},{"$f":"IF($C49=\"\",\"\",TEST!$F$25)","v":""},{"$f":"IF($C49=\"\",\"\",TEST!$J$25)","v":""},null,{"$f":"IF($C49=\"\",\"\",SUM(F49,H49,J49,L49))","v":""},null,{"$f":"IF($C49=\"\",\"\",MATCH($C49,Výsledky!$K$8:$K$57,0))","v":""}]
[null,null,null,{"$f":"IF(Start!$E$27=\"\",\"\",Start!$E$27)","v":""},{"$f":"IF(Start!$F$27=\"\",\"\",Start!$F$27)","v":""},null,{"$f":"IF($C49=\"\",\"\",'PJ-V'!$O25)","v":""},null,{"$f":"IF($C49=\"\",\"\",'DV-V'!$O25)","v":""}]
[null,{"$f":"Start!$C28","v":22},{"$f":"IF(Start!$D28=\"\",\"\",Start!$D28)","v":""},{"$f":"IF(Start!$E$28=\"\",\"\",Start!$E$28)","v":""},{"$f":"IF(Start!$F$28=\"\",\"\",Start!$F$28)","v":""},{"$f":"IF($C51=\"\",\"\",IF(V.l.ZPV!$C$6=\"\",\"0\",IF(ISNA(MATCH($C51,ZPVOblN,0)),COUNTIF(ZPVOblT,\".\")+1,LOOKUP($C51,ZPVOblN,ZPVOblD))))","v":""},{"$f":"IF($C51=\"\",\"\",'PJ-V'!$J26)","v":""},{"$f":"IF($C51=\"\",\"\",LOOKUP($C51,'PJ - P'!$Y$1:$Y$50,'PJ - P'!$Z$1:$Z$50))","v":""},{"$f":"IF($C51=\"\",\"\",'DV-V'!$J26)","v":""},{"$f":"IF($C51=\"\",\"\",LOOKUP($C51,'DV - P'!$Y$1:$Y$50,'DV - P'!$Z$1:$Z$50))","v":""},{"$f":"IF($C51=\"\",\"\",TEST!$F$26)","v":""},{"$f":"IF($C51=\"\",\"\",TEST!$J$26)","v":""},null,{"$f":"IF($C51=\"\",\"\",SUM(F51,H51,J51,L51))","v":""},null,{"$f":"IF($C51=\"\",\"\",MATCH($C51,Výsledky!$K$8:$K$57,0))","v":""}]
[null,null,null,{"$f":"IF(Start!$E$28=\"\",\"\",Start!$E$28)","v":""},{"$f":"IF(Start!$F$28=\"\",\"\",Start!$F$28)","v":""},null,{"$f":"IF($C51=\"\",\"\",'PJ-V'!$O26)","v":""},null,{"$f":"IF($C51=\"\",\"\",'DV-V'!$O26)","v":""}]
[null,{"$f":"Start!$C29","v":23},{"$f":"IF(Start!$D29=\"\",\"\",Start!$D29)","v":""},{"$f":"IF(Start!$E$29=\"\",\"\",Start!$E$29)","v":""},{"$f":"IF(Start!$F$29=\"\",\"\",Start!$F$29)","v":""},{"$f":"IF($C53=\"\",\"\",IF(V.l.ZPV!$C$6=\"\",\"0\",IF(ISNA(MATCH($C53,ZPVOblN,0)),COUNTIF(ZPVOblT,\".\")+1,LOOKUP($C53,ZPVOblN,ZPVOblD))))","v":""},{"$f":"IF($C53=\"\",\"\",'PJ-V'!$J27)","v":""},{"$f":"IF($C53=\"\",\"\",LOOKUP($C53,'PJ - P'!$Y$1:$Y$50,'PJ - P'!$Z$1:$Z$50))","v":""},{"$f":"IF($C53=\"\",\"\",'DV-V'!$J27)","v":""},{"$f":"IF($C53=\"\",\"\",LOOKUP($C53,'DV - P'!$Y$1:$Y$50,'DV - P'!$Z$1:$Z$50))","v":""},{"$f":"IF($C53=\"\",\"\",TEST!$F$27)","v":""},{"$f":"IF($C53=\"\",\"\",TEST!$J$27)","v":""},null,{"$f":"IF($C53=\"\",\"\",SUM(F53,H53,J53,L53))","v":""},null,{"$f":"IF($C53=\"\",\"\",MATCH($C53,Výsledky!$K$8:$K$57,0))","v":""}]
[null,null,null,{"$f":"IF(Start!$E$29=\"\",\"\",Start!$E$29)","v":""},{"$f":"IF(Start!$F$29=\"\",\"\",Start!$F$29)","v":""},null,{"$f":"IF($C53=\"\",\"\",'PJ-V'!$O27)","v":""},null,{"$f":"IF($C53=\"\",\"\",'DV-V'!$O27)","v":""}]
[null,{"$f":"Start!$C30","v":24},{"$f":"IF(Start!$D30=\"\",\"\",Start!$D30)","v":""},{"$f":"IF(Start!$E$30=\"\",\"\",Start!$E$30)","v":""},{"$f":"IF(Start!$F$30=\"\",\"\",Start!$F$30)","v":""},{"$f":"IF($C55=\"\",\"\",IF(V.l.ZPV!$C$6=\"\",\"0\",IF(ISNA(MATCH($C55,ZPVOblN,0)),COUNTIF(ZPVOblT,\".\")+1,LOOKUP($C55,ZPVOblN,ZPVOblD))))","v":""},{"$f":"IF($C55=\"\",\"\",'PJ-V'!$J28)","v":""},{"$f":"IF($C55=\"\",\"\",LOOKUP($C55,'PJ - P'!$Y$1:$Y$50,'PJ - P'!$Z$1:$Z$50))","v":""},{"$f":"IF($C55=\"\",\"\",'DV-V'!$J28)","v":""},{"$f":"IF($C55=\"\",\"\",LOOKUP($C55,'DV - P'!$Y$1:$Y$50,'DV - P'!$Z$1:$Z$50))","v":""},{"$f":"IF($C55=\"\",\"\",TEST!$F$28)","v":""},{"$f":"IF($C55=\"\",\"\",TEST!$J$28)","v":""},null,{"$f":"IF($C55=\"\",\"\",SUM(F55,H55,J55,L55))","v":""},null,{"$f":"IF($C55=\"\",\"\",MATCH($C55,Výsledky!$K$8:$K$57,0))","v":""}]
[null,null,null,{"$f":"IF(Start!$E$30=\"\",\"\",Start!$E$30)","v":""},{"$f":"IF(Start!$F$30=\"\",\"\",Start!$F$30)","v":""},null,{"$f":"IF($C55=\"\",\"\",'PJ-V'!$O28)","v":""},null,{"$f":"IF($C55=\"\",\"\",'DV-V'!$O28)","v":""}]
[null,{"$f":"Start!$C31","v":25},{"$f":"IF(Start!$D31=\"\",\"\",Start!$D31)","v":""},{"$f":"IF(Start!$E$31=\"\",\"\",Start!$E$31)","v":""},{"$f":"IF(Start!$F$31=\"\",\"\",Start!$F$31)","v":""},{"$f":"IF($C57=\"\",\"\",IF(V.l.ZPV!$C$6=\"\",\"0\",IF(ISNA(MATCH($C57,ZPVOblN,0)),COUNTIF(ZPVOblT,\".\")+1,LOOKUP($C57,ZPVOblN,ZPVOblD))))","v":""},{"$f":"IF($C57=\"\",\"\",'PJ-V'!$J29)","v":""},{"$f":"IF($C57=\"\",\"\",LOOKUP($C57,'PJ - P'!$Y$1:$Y$50,'PJ - P'!$Z$1:$Z$50))","v":""},{"$f":"IF($C57=\"\",\"\",'DV-V'!$J29)","v":""},{"$f":"IF($C57=\"\",\"\",LOOKUP($C57,'DV - P'!$Y$1:$Y$50,'DV - P'!$Z$1:$Z$50))","v":""},{"$f":"IF($C57=\"\",\"\",TEST!$F$29)","v":""},{"$f":"IF($C57=\"\",\"\",TEST!$J$29)","v":""},null,{"$f":"IF($C57=\"\",\"\",SUM(F57,H57,J57,L57))","v":""},null,{"$f":"IF($C57=\"\",\"\",MATCH($C57,Výsledky!$K$8:$K$57,0))","v":""}]
[null,null,null,{"$f":"IF(Start!$E$31=\"\",\"\",Start!$E$31)","v":""},{"$f":"IF(Start!$F$31=\"\",\"\",Start!$F$31)","v":""},null,{"$f":"IF($C57=\"\",\"\",'PJ-V'!$O29)","v":""},null,{"$f":"IF($C57=\"\",\"\",'DV-V'!$O29)","v":""}]
[null,{"$f":"B1","v":"Celkové výsledky - TISK"}]
[]
[null,null,{"$f":"C3","v":"Krajské kolo soutěží dorostu"},null,null,null,null,{"$f":"H3","v":"19. června 2021 Tachov"}]
[]
[null,null,{"$f":"C5","v":"Dorky - Střední"}]
[null," startovní číslo","Jméno","SDH",{"$f":"Start!$F$6","v":"Okres"}," ZPV","Běh na 100m s překážkami",null,"Dvojboj",null,"Test",null,null," Celkový součet bodů",null,"Celkové pořadí"]
[null,null,null,null,null,"P.","1.pokus","P.","1.pokus","P.","Tr.Bodů","P."]
[null,null,null,null,null,null,"2.pokus",null,"2.pokus"]
[null,{"$f":"Start!$C32","v":26},{"$f":"IF(Start!$D32=\"\",\"\",Start!$D32)","v":""},{"$f":"IF(Start!$E$32=\"\",\"\",Start!$E$32)","v":""},{"$f":"IF(Start!$F$32=\"\",\"\",Start!$F$32)","v":""},{"$f":"IF($C67=\"\",\"\",IF(V.l.ZPV!$C$6=\"\",\"0\",IF(ISNA(MATCH($C67,ZPVOblN,0)),COUNTIF(ZPVOblT,\".\")+1,LOOKUP($C67,ZPVOblN,ZPVOblD))))","v":""},{"$f":"IF($C67=\"\",\"\",'PJ-V'!$J30)","v":""},{"$f":"IF($C67=\"\",\"\",LOOKUP($C67,'PJ - P'!$Y$1:$Y$50,'PJ - P'!$Z$1:$Z$50))","v":""},{"$f":"IF($C67=\"\",\"\",'DV-V'!$J30)","v":""},{"$f":"IF($C67=\"\",\"\",LOOKUP($C67,'DV - P'!$Y$1:$Y$50,'DV - P'!$Z$1:$Z$50))","v":""},{"$f":"IF($C67=\"\",\"\",TEST!$F$30)","v":""},{"$f":"IF($C67=\"\",\"\",TEST!$J$30)","v":""},null,{"$f":"IF($C67=\"\",\"\",SUM(F67,H67,J67,L67))","v":""},null,{"$f":"IF($C67=\"\",\"\",MATCH($C67,Výsledky!$K$8:$K$57,0))","v":""}]
[null,null,null,{"$f":"IF(Start!$E$32=\"\",\"\",Start!$E$32)","v":""},{"$f":"IF(Start!$F$32=\"\",\"\",Start!$F$32)","v":""},null,{"$f":"IF($C67=\"\",\"\",'PJ-V'!$O30)","v":""},null,{"$f":"IF($C67=\"\",\"\",'DV-V'!$O30)","v":""}]
[null,{"$f":"Start!$C33","v":27},{"$f":"IF(Start!$D33=\"\",\"\",Start!$D33)","v":""},{"$f":"IF(Start!$E$33=\"\",\"\",Start!$E$33)","v":""},{"$f":"IF(Start!$F$33=\"\",\"\",Start!$F$33)","v":""},{"$f":"IF($C69=\"\",\"\",IF(V.l.ZPV!$C$6=\"\",\"0\",IF(ISNA(MATCH($C69,ZPVOblN,0)),COUNTIF(ZPVOblT,\".\")+1,LOOKUP($C69,ZPVOblN,ZPVOblD))))","v":""},{"$f":"IF($C69=\"\",\"\",'PJ-V'!$J31)","v":""},{"$f":"IF($C69=\"\",\"\",LOOKUP($C69,'PJ - P'!$Y$1:$Y$50,'PJ - P'!$Z$1:$Z$50))","v":""},{"$f":"IF($C69=\"\",\"\",'DV-V'!$J31)","v":""},{"$f":"IF($C69=\"\",\"\",LOOKUP($C69,'DV - P'!$Y$1:$Y$50,'DV - P'!$Z$1:$Z$50))","v":""},{"$f":"IF($C69=\"\",\"\",TEST!$F$31)","v":""},{"$f":"IF($C69=\"\",\"\",TEST!$J$31)","v":""},null,{"$f":"IF($C69=\"\",\"\",SUM(F69,H69,J69,L69))","v":""},null,{"$f":"IF($C69=\"\",\"\",MATCH($C69,Výsledky!$K$8:$K$57,0))","v":""}]
[null,null,null,{"$f":"IF(Start!$E$33=\"\",\"\",Start!$E$33)","v":""},{"$f":"IF(Start!$F$33=\"\",\"\",Start!$F$33)","v":""},null,{"$f":"IF($C69=\"\",\"\",'PJ-V'!$O31)","v":""},null,{"$f":"IF($C69=\"\",\"\",'DV-V'!$O31)","v":""}]
[null,{"$f":"Start!$C34","v":28},{"$f":"IF(Start!$D34=\"\",\"\",Start!$D34)","v":""},{"$f":"IF(Start!$E$34=\"\",\"\",Start!$E$34)","v":""},{"$f":"IF(Start!$F$34=\"\",\"\",Start!$F$34)","v":""},{"$f":"IF($C71=\"\",\"\",IF(V.l.ZPV!$C$6=\"\",\"0\",IF(ISNA(MATCH($C71,ZPVOblN,0)),COUNTIF(ZPVOblT,\".\")+1,LOOKUP($C71,ZPVOblN,ZPVOblD))))","v":""},{"$f":"IF($C71=\"\",\"\",'PJ-V'!$J32)","v":""},{"$f":"IF($C71=\"\",\"\",LOOKUP($C71,'PJ - P'!$Y$1:$Y$50,'PJ - P'!$Z$1:$Z$50))","v":""},{"$f":"IF($C71=\"\",\"\",'DV-V'!$J32)","v":""},{"$f":"IF($C71=\"\",\"\",LOOKUP($C71,'DV - P'!$Y$1:$Y$50,'DV - P'!$Z$1:$Z$50))","v":""},{"$f":"IF($C71=\"\",\"\",TEST!$F$32)","v":""},{"$f":"IF($C71=\"\",\"\",TEST!$J$32)","v":""},null,{"$f":"IF($C71=\"\",\"\",SUM(F71,H71,J71,L71))","v":""},null,{"$f":"IF($C71=\"\",\"\",MATCH($C71,Výsledky!$K$8:$K$57,0))","v":""}]
[null,null,null,{"$f":"IF(Start!$E$34=\"\",\"\",Start!$E$34)","v":""},{"$f":"IF(Start!$F$34=\"\",\"\",Start!$F$34)","v":""},null,{"$f":"IF($C71=\"\",\"\",'PJ-V'!$O32)","v":""},null,{"$f":"IF($C71=\"\",\"\",'DV-V'!$O32)","v":""}]
[null,{"$f":"Start!$C35","v":29},{"$f":"IF(Start!$D35=\"\",\"\",Start!$D35)","v":""},{"$f":"IF(Start!$E$35=\"\",\"\",Start!$E$35)","v":""},{"$f":"IF(Start!$F$35=\"\",\"\",Start!$F$35)","v":""},{"$f":"IF($C73=\"\",\"\",IF(V.l.ZPV!$C$6=\"\",\"0\",IF(ISNA(MATCH($C73,ZPVOblN,0)),COUNTIF(ZPVOblT,\".\")+1,LOOKUP($C73,ZPVOblN,ZPVOblD))))","v":""},{"$f":"IF($C73=\"\",\"\",'PJ-V'!$J33)","v":""},{"$f":"IF($C73=\"\",\"\",LOOKUP($C73,'PJ - P'!$Y$1:$Y$50,'PJ - P'!$Z$1:$Z$50))","v":""},{"$f":"IF($C73=\"\",\"\",'DV-V'!$J33)","v":""},{"$f":"IF($C73=\"\",\"\",LOOKUP($C73,'DV - P'!$Y$1:$Y$50,'DV - P'!$Z$1:$Z$50))","v":""},{"$f":"IF($C73=\"\",\"\",TEST!$F$33)","v":""},{"$f":"IF($C73=\"\",\"\",TEST!$J$33)","v":""},null,{"$f":"IF($C73=\"\",\"\",SUM(F73,H73,J73,L73))","v":""},null,{"$f":"IF($C73=\"\",\"\",MATCH($C73,Výsledky!$K$8:$K$57,0))","v":""}]
[null,null,null,{"$f":"IF(Start!$E$35=\"\",\"\",Start!$E$35)","v":""},{"$f":"IF(Start!$F$35=\"\",\"\",Start!$F$35)","v":""},null,{"$f":"IF($C73=\"\",\"\",'PJ-V'!$O33)","v":""},null,{"$f":"IF($C73=\"\",\"\",'DV-V'!$O33)","v":""}]
[null,{"$f":"Start!$C36","v":30},{"$f":"IF(Start!$D36=\"\",\"\",Start!$D36)","v":""},{"$f":"IF(Start!$E$36=\"\",\"\",Start!$E$36)","v":""},{"$f":"IF(Start!$F$36=\"\",\"\",Start!$F$36)","v":""},{"$f":"IF($C75=\"\",\"\",IF(V.l.ZPV!$C$6=\"\",\"0\",IF(ISNA(MATCH($C75,ZPVOblN,0)),COUNTIF(ZPVOblT,\".\")+1,LOOKUP($C75,ZPVOblN,ZPVOblD))))","v":""},{"$f":"IF($C75=\"\",\"\",'PJ-V'!$J34)","v":""},{"$f":"IF($C75=\"\",\"\",LOOKUP($C75,'PJ - P'!$Y$1:$Y$50,'PJ - P'!$Z$1:$Z$50))","v":""},{"$f":"IF($C75=\"\",\"\",'DV-V'!$J34)","v":""},{"$f":"IF($C75=\"\",\"\",LOOKUP($C75,'DV - P'!$Y$1:$Y$50,'DV - P'!$Z$1:$Z$50))","v":""},{"$f":"IF($C75=\"\",\"\",TEST!$F$34)","v":""},{"$f":"IF($C75=\"\",\"\",TEST!$J$34)","v":""},null,{"$f":"IF($C75=\"\",\"\",SUM(F75,H75,J75,L75))","v":""},null,{"$f":"IF($C75=\"\",\"\",MATCH($C75,Výsledky!$K$8:$K$57,0))","v":""}]
[null,null,null,{"$f":"IF(Start!$E$36=\"\",\"\",Start!$E$36)","v":""},{"$f":"IF(Start!$F$36=\"\",\"\",Start!$F$36)","v":""},null,{"$f":"IF($C75=\"\",\"\",'PJ-V'!$O34)","v":""},null,{"$f":"IF($C75=\"\",\"\",'DV-V'!$O34)","v":""}]
[null,{"$f":"Start!$C37","v":31},{"$f":"IF(Start!$D37=\"\",\"\",Start!$D37)","v":""},{"$f":"IF(Start!$E$37=\"\",\"\",Start!$E$37)","v":""},{"$f":"IF(Start!$F$37=\"\",\"\",Start!$F$37)","v":""},{"$f":"IF($C77=\"\",\"\",IF(V.l.ZPV!$C$6=\"\",\"0\",IF(ISNA(MATCH($C77,ZPVOblN,0)),COUNTIF(ZPVOblT,\".\")+1,LOOKUP($C77,ZPVOblN,ZPVOblD))))","v":""},{"$f":"IF($C77=\"\",\"\",'PJ-V'!$J35)","v":""},{"$f":"IF($C77=\"\",\"\",LOOKUP($C77,'PJ - P'!$Y$1:$Y$50,'PJ - P'!$Z$1:$Z$50))","v":""},{"$f":"IF($C77=\"\",\"\",'DV-V'!$J35)","v":""},{"$f":"IF($C77=\"\",\"\",LOOKUP($C77,'DV - P'!$Y$1:$Y$50,'DV - P'!$Z$1:$Z$50))","v":""},{"$f":"IF($C77=\"\",\"\",TEST!$F$35)","v":""},{"$f":"IF($C77=\"\",\"\",TEST!$J$35)","v":""},null,{"$f":"IF($C77=\"\",\"\",SUM(F77,H77,J77,L77))","v":""},null,{"$f":"IF($C77=\"\",\"\",MATCH($C77,Výsledky!$K$8:$K$57,0))","v":""}]
[null,null,null,{"$f":"IF(Start!$E$37=\"\",\"\",Start!$E$37)","v":""},{"$f":"IF(Start!$F$37=\"\",\"\",Start!$F$37)","v":""},null,{"$f":"IF($C77=\"\",\"\",'PJ-V'!$O35)","v":""},null,{"$f":"IF($C77=\"\",\"\",'DV-V'!$O35)","v":""}]
[null,{"$f":"Start!$C38","v":32},{"$f":"IF(Start!$D38=\"\",\"\",Start!$D38)","v":""},{"$f":"IF(Start!$E$38=\"\",\"\",Start!$E$38)","v":""},{"$f":"IF(Start!$F$38=\"\",\"\",Start!$F$38)","v":""},{"$f":"IF($C79=\"\",\"\",IF(V.l.ZPV!$C$6=\"\",\"0\",IF(ISNA(MATCH($C79,ZPVOblN,0)),COUNTIF(ZPVOblT,\".\")+1,LOOKUP($C79,ZPVOblN,ZPVOblD))))","v":""},{"$f":"IF($C79=\"\",\"\",'PJ-V'!$J36)","v":""},{"$f":"IF($C79=\"\",\"\",LOOKUP($C79,'PJ - P'!$Y$1:$Y$50,'PJ - P'!$Z$1:$Z$50))","v":""},{"$f":"IF($C79=\"\",\"\",'DV-V'!$J36)","v":""},{"$f":"IF($C79=\"\",\"\",LOOKUP($C79,'DV - P'!$Y$1:$Y$50,'DV - P'!$Z$1:$Z$50))","v":""},{"$f":"IF($C79=\"\",\"\",TEST!$F$36)","v":""},{"$f":"IF($C79=\"\",\"\",TEST!$J$36)","v":""},null,{"$f":"IF($C79=\"\",\"\",SUM(F79,H79,J79,L79))","v":""},null,{"$f":"IF($C79=\"\",\"\",MATCH($C79,Výsledky!$K$8:$K$57,0))","v":""}]
[null,null,null,{"$f":"IF(Start!$E$38=\"\",\"\",Start!$E$38)","v":""},{"$f":"IF(Start!$F$38=\"\",\"\",Start!$F$38)","v":""},null,{"$f":"IF($C79=\"\",\"\",'PJ-V'!$O36)","v":""},null,{"$f":"IF($C79=\"\",\"\",'DV-V'!$O36)","v":""}]
[null,{"$f":"Start!$C39","v":33},{"$f":"IF(Start!$D39=\"\",\"\",Start!$D39)","v":""},{"$f":"IF(Start!$E$39=\"\",\"\",Start!$E$39)","v":""},{"$f":"IF(Start!$F$39=\"\",\"\",Start!$F$39)","v":""},{"$f":"IF($C81=\"\",\"\",IF(V.l.ZPV!$C$6=\"\",\"0\",IF(ISNA(MATCH($C81,ZPVOblN,0)),COUNTIF(ZPVOblT,\".\")+1,LOOKUP($C81,ZPVOblN,ZPVOblD))))","v":""},{"$f":"IF($C81=\"\",\"\",'PJ-V'!$J37)","v":""},{"$f":"IF($C81=\"\",\"\",LOOKUP($C81,'PJ - P'!$Y$1:$Y$50,'PJ - P'!$Z$1:$Z$50))","v":""},{"$f":"IF($C81=\"\",\"\",'DV-V'!$J37)","v":""},{"$f":"IF($C81=\"\",\"\",LOOKUP($C81,'DV - P'!$Y$1:$Y$50,'DV - P'!$Z$1:$Z$50))","v":""},{"$f":"IF($C81=\"\",\"\",TEST!$F$37)","v":""},{"$f":"IF($C81=\"\",\"\",TEST!$J$37)","v":""},null,{"$f":"IF($C81=\"\",\"\",SUM(F81,H81,J81,L81))","v":""},null,{"$f":"IF($C81=\"\",\"\",MATCH($C81,Výsledky!$K$8:$K$57,0))","v":""}]
[null,null,null,{"$f":"IF(Start!$E$39=\"\",\"\",Start!$E$39)","v":""},{"$f":"IF(Start!$F$39=\"\",\"\",Start!$F$39)","v":""},null,{"$f":"IF($C81=\"\",\"\",'PJ-V'!$O37)","v":""},null,{"$f":"IF($C81=\"\",\"\",'DV-V'!$O37)","v":""}]
[null,{"$f":"Start!$C40","v":34},{"$f":"IF(Start!$D40=\"\",\"\",Start!$D40)","v":""},{"$f":"IF(Start!$E$40=\"\",\"\",Start!$E$40)","v":""},{"$f":"IF(Start!$F$40=\"\",\"\",Start!$F$40)","v":""},{"$f":"IF($C83=\"\",\"\",IF(V.l.ZPV!$C$6=\"\",\"0\",IF(ISNA(MATCH($C83,ZPVOblN,0)),COUNTIF(ZPVOblT,\".\")+1,LOOKUP($C83,ZPVOblN,ZPVOblD))))","v":""},{"$f":"IF($C83=\"\",\"\",'PJ-V'!$J38)","v":""},{"$f":"IF($C83=\"\",\"\",LOOKUP($C83,'PJ - P'!$Y$1:$Y$50,'PJ - P'!$Z$1:$Z$50))","v":""},{"$f":"IF($C83=\"\",\"\",'DV-V'!$J38)","v":""},{"$f":"IF($C83=\"\",\"\",LOOKUP($C83,'DV - P'!$Y$1:$Y$50,'DV - P'!$Z$1:$Z$50))","v":""},{"$f":"IF($C83=\"\",\"\",TEST!$F$38)","v":""},{"$f":"IF($C83=\"\",\"\",TEST!$J$38)","v":""},null,{"$f":"IF($C83=\"\",\"\",SUM(F83,H83,J83,L83))","v":""},null,{"$f":"IF($C83=\"\",\"\",MATCH($C83,Výsledky!$K$8:$K$57,0))","v":""}]
[null,null,null,{"$f":"IF(Start!$E$40=\"\",\"\",Start!$E$40)","v":""},{"$f":"IF(Start!$F$40=\"\",\"\",Start!$F$40)","v":""},null,{"$f":"IF($C83=\"\",\"\",'PJ-V'!$O38)","v":""},null,{"$f":"IF($C83=\"\",\"\",'DV-V'!$O38)","v":""}]
[null,{"$f":"Start!$C41","v":35},{"$f":"IF(Start!$D41=\"\",\"\",Start!$D41)","v":""},{"$f":"IF(Start!$E$41=\"\",\"\",Start!$E$41)","v":""},{"$f":"IF(Start!$F$41=\"\",\"\",Start!$F$41)","v":""},{"$f":"IF($C85=\"\",\"\",IF(V.l.ZPV!$C$6=\"\",\"0\",IF(ISNA(MATCH($C85,ZPVOblN,0)),COUNTIF(ZPVOblT,\".\")+1,LOOKUP($C85,ZPVOblN,ZPVOblD))))","v":""},{"$f":"IF($C85=\"\",\"\",'PJ-V'!$J39)","v":""},{"$f":"IF($C85=\"\",\"\",LOOKUP($C85,'PJ - P'!$Y$1:$Y$50,'PJ - P'!$Z$1:$Z$50))","v":""},{"$f":"IF($C85=\"\",\"\",'DV-V'!$J39)","v":""},{"$f":"IF($C85=\"\",\"\",LOOKUP($C85,'DV - P'!$Y$1:$Y$50,'DV - P'!$Z$1:$Z$50))","v":""},{"$f":"IF($C85=\"\",\"\",TEST!$F$39)","v":""},{"$f":"IF($C85=\"\",\"\",TEST!$J$39)","v":""},null,{"$f":"IF($C85=\"\",\"\",SUM(F85,H85,J85,L85))","v":""},null,{"$f":"IF($C85=\"\",\"\",MATCH($C85,Výsledky!$K$8:$K$57,0))","v":""}]
[null,null,null,{"$f":"IF(Start!$E$41=\"\",\"\",Start!$E$41)","v":""},{"$f":"IF(Start!$F$41=\"\",\"\",Start!$F$41)","v":""},null,{"$f":"IF($C85=\"\",\"\",'PJ-V'!$O39)","v":""},null,{"$f":"IF($C85=\"\",\"\",'DV-V'!$O39)","v":""}]
[null,{"$f":"Start!$C42","v":36},{"$f":"IF(Start!$D42=\"\",\"\",Start!$D42)","v":""},{"$f":"IF(Start!$E$42=\"\",\"\",Start!$E$42)","v":""},{"$f":"IF(Start!$F$42=\"\",\"\",Start!$F$42)","v":""},{"$f":"IF($C87=\"\",\"\",IF(V.l.ZPV!$C$6=\"\",\"0\",IF(ISNA(MATCH($C87,ZPVOblN,0)),COUNTIF(ZPVOblT,\".\")+1,LOOKUP($C87,ZPVOblN,ZPVOblD))))","v":""},{"$f":"IF($C87=\"\",\"\",'PJ-V'!$J40)","v":""},{"$f":"IF($C87=\"\",\"\",LOOKUP($C87,'PJ - P'!$Y$1:$Y$50,'PJ - P'!$Z$1:$Z$50))","v":""},{"$f":"IF($C87=\"\",\"\",'DV-V'!$J40)","v":""},{"$f":"IF($C87=\"\",\"\",LOOKUP($C87,'DV - P'!$Y$1:$Y$50,'DV - P'!$Z$1:$Z$50))","v":""},{"$f":"IF($C87=\"\",\"\",TEST!$F$40)","v":""},{"$f":"IF($C87=\"\",\"\",TEST!$J$40)","v":""},null,{"$f":"IF($C87=\"\",\"\",SUM(F87,H87,J87,L87))","v":""},null,{"$f":"IF($C87=\"\",\"\",MATCH($C87,Výsledky!$K$8:$K$57,0))","v":""}]
[null,null,null,{"$f":"IF(Start!$E$42=\"\",\"\",Start!$E$42)","v":""},{"$f":"IF(Start!$F$42=\"\",\"\",Start!$F$42)","v":""},null,{"$f":"IF($C87=\"\",\"\",'PJ-V'!$O40)","v":""},null,{"$f":"IF($C87=\"\",\"\",'DV-V'!$O40)","v":""}]
[null,{"$f":"Start!$C43","v":37},{"$f":"IF(Start!$D43=\"\",\"\",Start!$D43)","v":""},{"$f":"IF(Start!$E$43=\"\",\"\",Start!$E$43)","v":""},{"$f":"IF(Start!$F$43=\"\",\"\",Start!$F$43)","v":""},{"$f":"IF($C89=\"\",\"\",IF(V.l.ZPV!$C$6=\"\",\"0\",IF(ISNA(MATCH($C89,ZPVOblN,0)),COUNTIF(ZPVOblT,\".\")+1,LOOKUP($C89,ZPVOblN,ZPVOblD))))","v":""},{"$f":"IF($C89=\"\",\"\",'PJ-V'!$J41)","v":""},{"$f":"IF($C89=\"\",\"\",LOOKUP($C89,'PJ - P'!$Y$1:$Y$50,'PJ - P'!$Z$1:$Z$50))","v":""},{"$f":"IF($C89=\"\",\"\",'DV-V'!$J41)","v":""},{"$f":"IF($C89=\"\",\"\",LOOKUP($C89,'DV - P'!$Y$1:$Y$50,'DV - P'!$Z$1:$Z$50))","v":""},{"$f":"IF($C89=\"\",\"\",TEST!$F$41)","v":""},{"$f":"IF($C89=\"\",\"\",TEST!$J$41)","v":""},null,{"$f":"IF($C89=\"\",\"\",SUM(F89,H89,J89,L89))","v":""},null,{"$f":"IF($C89=\"\",\"\",MATCH($C89,Výsledky!$K$8:$K$57,0))","v":""}]
[null,null,null,{"$f":"IF(Start!$E$43=\"\",\"\",Start!$E$43)","v":""},{"$f":"IF(Start!$F$43=\"\",\"\",Start!$F$43)","v":""},null,{"$f":"IF($C89=\"\",\"\",'PJ-V'!$O41)","v":""},null,{"$f":"IF($C89=\"\",\"\",'DV-V'!$O41)","v":""}]
[null,{"$f":"Start!$C44","v":38},{"$f":"IF(Start!$D44=\"\",\"\",Start!$D44)","v":""},{"$f":"IF(Start!$E$44=\"\",\"\",Start!$E$44)","v":""},{"$f":"IF(Start!$F$44=\"\",\"\",Start!$F$44)","v":""},{"$f":"IF($C91=\"\",\"\",IF(V.l.ZPV!$C$6=\"\",\"0\",IF(ISNA(MATCH($C91,ZPVOblN,0)),COUNTIF(ZPVOblT,\".\")+1,LOOKUP($C91,ZPVOblN,ZPVOblD))))","v":""},{"$f":"IF($C91=\"\",\"\",'PJ-V'!$J42)","v":""},{"$f":"IF($C91=\"\",\"\",LOOKUP($C91,'PJ - P'!$Y$1:$Y$50,'PJ - P'!$Z$1:$Z$50))","v":""},{"$f":"IF($C91=\"\",\"\",'DV-V'!$J42)","v":""},{"$f":"IF($C91=\"\",\"\",LOOKUP($C91,'DV - P'!$Y$1:$Y$50,'DV - P'!$Z$1:$Z$50))","v":""},{"$f":"IF($C91=\"\",\"\",TEST!$F$42)","v":""},{"$f":"IF($C91=\"\",\"\",TEST!$J$42)","v":""},null,{"$f":"IF($C91=\"\",\"\",SUM(F91,H91,J91,L91))","v":""},null,{"$f":"IF($C91=\"\",\"\",MATCH($C91,Výsledky!$K$8:$K$57,0))","v":""}]
[null,null,null,{"$f":"IF(Start!$E$44=\"\",\"\",Start!$E$44)","v":""},{"$f":"IF(Start!$F$44=\"\",\"\",Start!$F$44)","v":""},null,{"$f":"IF($C91=\"\",\"\",'PJ-V'!$O42)","v":""},null,{"$f":"IF($C91=\"\",\"\",'DV-V'!$O42)","v":""}]
[null,{"$f":"Start!$C45","v":39},{"$f":"IF(Start!$D45=\"\",\"\",Start!$D45)","v":""},{"$f":"IF(Start!$E$45=\"\",\"\",Start!$E$45)","v":""},{"$f":"IF(Start!$F$45=\"\",\"\",Start!$F$45)","v":""},{"$f":"IF($C93=\"\",\"\",IF(V.l.ZPV!$C$6=\"\",\"0\",IF(ISNA(MATCH($C93,ZPVOblN,0)),COUNTIF(ZPVOblT,\".\")+1,LOOKUP($C93,ZPVOblN,ZPVOblD))))","v":""},{"$f":"IF($C93=\"\",\"\",'PJ-V'!$J43)","v":""},{"$f":"IF($C93=\"\",\"\",LOOKUP($C93,'PJ - P'!$Y$1:$Y$50,'PJ - P'!$Z$1:$Z$50))","v":""},{"$f":"IF($C93=\"\",\"\",'DV-V'!$J43)","v":""},{"$f":"IF($C93=\"\",\"\",LOOKUP($C93,'DV - P'!$Y$1:$Y$50,'DV - P'!$Z$1:$Z$50))","v":""},{"$f":"IF($C93=\"\",\"\",TEST!$F$43)","v":""},{"$f":"IF($C93=\"\",\"\",TEST!$J$43)","v":""},null,{"$f":"IF($C93=\"\",\"\",SUM(F93,H93,J93,L93))","v":""},null,{"$f":"IF($C93=\"\",\"\",MATCH($C93,Výsledky!$K$8:$K$57,0))","v":""}]
[null,null,null,{"$f":"IF(Start!$E$45=\"\",\"\",Start!$E$45)","v":""},{"$f":"IF(Start!$F$45=\"\",\"\",Start!$F$45)","v":""},null,{"$f":"IF($C93=\"\",\"\",'PJ-V'!$O43)","v":""},null,{"$f":"IF($C93=\"\",\"\",'DV-V'!$O43)","v":""}]
[null,{"$f":"Start!$C46","v":40},{"$f":"IF(Start!$D46=\"\",\"\",Start!$D46)","v":""},{"$f":"IF(Start!$E$46=\"\",\"\",Start!$E$46)","v":""},{"$f":"IF(Start!$F$46=\"\",\"\",Start!$F$46)","v":""},{"$f":"IF($C95=\"\",\"\",IF(V.l.ZPV!$C$6=\"\",\"0\",IF(ISNA(MATCH($C95,ZPVOblN,0)),COUNTIF(ZPVOblT,\".\")+1,LOOKUP($C95,ZPVOblN,ZPVOblD))))","v":""},{"$f":"IF($C95=\"\",\"\",'PJ-V'!$J44)","v":""},{"$f":"IF($C95=\"\",\"\",LOOKUP($C95,'PJ - P'!$Y$1:$Y$50,'PJ - P'!$Z$1:$Z$50))","v":""},{"$f":"IF($C95=\"\",\"\",'DV-V'!$J44)","v":""},{"$f":"IF($C95=\"\",\"\",LOOKUP($C95,'DV - P'!$Y$1:$Y$50,'DV - P'!$Z$1:$Z$50))","v":""},{"$f":"IF($C95=\"\",\"\",TEST!$F$44)","v":""},{"$f":"IF($C95=\"\",\"\",TEST!$J$44)","v":""},null,{"$f":"IF($C95=\"\",\"\",SUM(F95,H95,J95,L95))","v":""},null,{"$f":"IF($C95=\"\",\"\",MATCH($C95,Výsledky!$K$8:$K$57,0))","v":""}]
[null,null,null,{"$f":"IF(Start!$E$46=\"\",\"\",Start!$E$46)","v":""},{"$f":"IF(Start!$F$46=\"\",\"\",Start!$F$46)","v":""},null,{"$f":"IF($C95=\"\",\"\",'PJ-V'!$O44)","v":""},null,{"$f":"IF($C95=\"\",\"\",'DV-V'!$O44)","v":""}]
[null,{"$f":"Start!$C47","v":41},{"$f":"IF(Start!$D47=\"\",\"\",Start!$D47)","v":""},{"$f":"IF(Start!$E$47=\"\",\"\",Start!$E$47)","v":""},{"$f":"IF(Start!$F$47=\"\",\"\",Start!$F$47)","v":""},{"$f":"IF($C97=\"\",\"\",IF(V.l.ZPV!$C$6=\"\",\"0\",IF(ISNA(MATCH($C97,ZPVOblN,0)),COUNTIF(ZPVOblT,\".\")+1,LOOKUP($C97,ZPVOblN,ZPVOblD))))","v":""},{"$f":"IF($C97=\"\",\"\",'PJ-V'!$J45)","v":""},{"$f":"IF($C97=\"\",\"\",LOOKUP($C97,'PJ - P'!$Y$1:$Y$50,'PJ - P'!$Z$1:$Z$50))","v":""},{"$f":"IF($C97=\"\",\"\",'DV-V'!$J45)","v":""},{"$f":"IF($C97=\"\",\"\",LOOKUP($C97,'DV - P'!$Y$1:$Y$50,'DV - P'!$Z$1:$Z$50))","v":""},{"$f":"IF($C97=\"\",\"\",TEST!$F$45)","v":""},{"$f":"IF($C97=\"\",\"\",TEST!$J$45)","v":""},null,{"$f":"IF($C97=\"\",\"\",SUM(F97,H97,J97,L97))","v":""},null,{"$f":"IF($C97=\"\",\"\",MATCH($C97,Výsledky!$K$8:$K$57,0))","v":""}]
[null,null,null,{"$f":"IF(Start!$E$47=\"\",\"\",Start!$E$47)","v":""},{"$f":"IF(Start!$F$47=\"\",\"\",Start!$F$47)","v":""},null,{"$f":"IF($C97=\"\",\"\",'PJ-V'!$O45)","v":""},null,{"$f":"IF($C97=\"\",\"\",'DV-V'!$O45)","v":""}]
[null,{"$f":"Start!$C48","v":42},{"$f":"IF(Start!$D48=\"\",\"\",Start!$D48)","v":""},{"$f":"IF(Start!$E$48=\"\",\"\",Start!$E$48)","v":""},{"$f":"IF(Start!$F$48=\"\",\"\",Start!$F$48)","v":""},{"$f":"IF($C99=\"\",\"\",IF(V.l.ZPV!$C$6=\"\",\"0\",IF(ISNA(MATCH($C99,ZPVOblN,0)),COUNTIF(ZPVOblT,\".\")+1,LOOKUP($C99,ZPVOblN,ZPVOblD))))","v":""},{"$f":"IF($C99=\"\",\"\",'PJ-V'!$J46)","v":""},{"$f":"IF($C99=\"\",\"\",LOOKUP($C99,'PJ - P'!$Y$1:$Y$50,'PJ - P'!$Z$1:$Z$50))","v":""},{"$f":"IF($C99=\"\",\"\",'DV-V'!$J46)","v":""},{"$f":"IF($C99=\"\",\"\",LOOKUP($C99,'DV - P'!$Y$1:$Y$50,'DV - P'!$Z$1:$Z$50))","v":""},{"$f":"IF($C99=\"\",\"\",TEST!$F$46)","v":""},{"$f":"IF($C99=\"\",\"\",TEST!$J$46)","v":""},null,{"$f":"IF($C99=\"\",\"\",SUM(F99,H99,J99,L99))","v":""},null,{"$f":"IF($C99=\"\",\"\",MATCH($C99,Výsledky!$K$8:$K$57,0))","v":""}]
[null,null,null,{"$f":"IF(Start!$E$48=\"\",\"\",Start!$E$48)","v":""},{"$f":"IF(Start!$F$48=\"\",\"\",Start!$F$48)","v":""},null,{"$f":"IF($C99=\"\",\"\",'PJ-V'!$O46)","v":""},null,{"$f":"IF($C99=\"\",\"\",'DV-V'!$O46)","v":""}]
[null,{"$f":"Start!$C49","v":43},{"$f":"IF(Start!$D49=\"\",\"\",Start!$D49)","v":""},{"$f":"IF(Start!$E$49=\"\",\"\",Start!$E$49)","v":""},{"$f":"IF(Start!$F$49=\"\",\"\",Start!$F$49)","v":""},{"$f":"IF($C101=\"\",\"\",IF(V.l.ZPV!$C$6=\"\",\"0\",IF(ISNA(MATCH($C101,ZPVOblN,0)),COUNTIF(ZPVOblT,\".\")+1,LOOKUP($C101,ZPVOblN,ZPVOblD))))","v":""},{"$f":"IF($C101=\"\",\"\",'PJ-V'!$J47)","v":""},{"$f":"IF($C101=\"\",\"\",LOOKUP($C101,'PJ - P'!$Y$1:$Y$50,'PJ - P'!$Z$1:$Z$50))","v":""},{"$f":"IF($C101=\"\",\"\",'DV-V'!$J47)","v":""},{"$f":"IF($C101=\"\",\"\",LOOKUP($C101,'DV - P'!$Y$1:$Y$50,'DV - P'!$Z$1:$Z$50))","v":""},{"$f":"IF($C101=\"\",\"\",TEST!$F$47)","v":""},{"$f":"IF($C101=\"\",\"\",TEST!$J$47)","v":""},null,{"$f":"IF($C101=\"\",\"\",SUM(F101,H101,J101,L101))","v":""},null,{"$f":"IF($C101=\"\",\"\",MATCH($C101,Výsledky!$K$8:$K$57,0))","v":""}]
[null,null,null,{"$f":"IF(Start!$E$49=\"\",\"\",Start!$E$49)","v":""},{"$f":"IF(Start!$F$49=\"\",\"\",Start!$F$49)","v":""},null,{"$f":"IF($C101=\"\",\"\",'PJ-V'!$O47)","v":""},null,{"$f":"IF($C101=\"\",\"\",'DV-V'!$O47)","v":""}]
[null,{"$f":"Start!$C50","v":44},{"$f":"IF(Start!$D50=\"\",\"\",Start!$D50)","v":""},{"$f":"IF(Start!$E$50=\"\",\"\",Start!$E$50)","v":""},{"$f":"IF(Start!$F$50=\"\",\"\",Start!$F$50)","v":""},{"$f":"IF($C103=\"\",\"\",IF(V.l.ZPV!$C$6=\"\",\"0\",IF(ISNA(MATCH($C103,ZPVOblN,0)),COUNTIF(ZPVOblT,\".\")+1,LOOKUP($C103,ZPVOblN,ZPVOblD))))","v":""},{"$f":"IF($C103=\"\",\"\",'PJ-V'!$J48)","v":""},{"$f":"IF($C103=\"\",\"\",LOOKUP($C103,'PJ - P'!$Y$1:$Y$50,'PJ - P'!$Z$1:$Z$50))","v":""},{"$f":"IF($C103=\"\",\"\",'DV-V'!$J48)","v":""},{"$f":"IF($C103=\"\",\"\",LOOKUP($C103,'DV - P'!$Y$1:$Y$50,'DV - P'!$Z$1:$Z$50))","v":""},{"$f":"IF($C103=\"\",\"\",TEST!$F$48)","v":""},{"$f":"IF($C103=\"\",\"\",TEST!$J$48)","v":""},null,{"$f":"IF($C103=\"\",\"\",SUM(F103,H103,J103,L103))","v":""},null,{"$f":"IF($C103=\"\",\"\",MATCH($C103,Výsledky!$K$8:$K$57,0))","v":""}]
[null,null,null,{"$f":"IF(Start!$E$50=\"\",\"\",Start!$E$50)","v":""},{"$f":"IF(Start!$F$50=\"\",\"\",Start!$F$50)","v":""},null,{"$f":"IF($C103=\"\",\"\",'PJ-V'!$O48)","v":""},null,{"$f":"IF($C103=\"\",\"\",'DV-V'!$O48)","v":""}]
[null,{"$f":"Start!$C51","v":45},{"$f":"IF(Start!$D51=\"\",\"\",Start!$D51)","v":""},{"$f":"IF(Start!$E$51=\"\",\"\",Start!$E$51)","v":""},{"$f":"IF(Start!$F$51=\"\",\"\",Start!$F$51)","v":""},{"$f":"IF($C105=\"\",\"\",IF(V.l.ZPV!$C$6=\"\",\"0\",IF(ISNA(MATCH($C105,ZPVOblN,0)),COUNTIF(ZPVOblT,\".\")+1,LOOKUP($C105,ZPVOblN,ZPVOblD))))","v":""},{"$f":"IF($C105=\"\",\"\",'PJ-V'!$J49)","v":""},{"$f":"IF($C105=\"\",\"\",LOOKUP($C105,'PJ - P'!$Y$1:$Y$50,'PJ - P'!$Z$1:$Z$50))","v":""},{"$f":"IF($C105=\"\",\"\",'DV-V'!$J49)","v":""},{"$f":"IF($C105=\"\",\"\",LOOKUP($C105,'DV - P'!$Y$1:$Y$50,'DV - P'!$Z$1:$Z$50))","v":""},{"$f":"IF($C105=\"\",\"\",TEST!$F$49)","v":""},{"$f":"IF($C105=\"\",\"\",TEST!$J$49)","v":""},null,{"$f":"IF($C105=\"\",\"\",SUM(F105,H105,J105,L105))","v":""},null,{"$f":"IF($C105=\"\",\"\",MATCH($C105,Výsledky!$K$8:$K$57,0))","v":""}]
[null,null,null,{"$f":"IF(Start!$E$51=\"\",\"\",Start!$E$51)","v":""},{"$f":"IF(Start!$F$51=\"\",\"\",Start!$F$51)","v":""},null,{"$f":"IF($C105=\"\",\"\",'PJ-V'!$O49)","v":""},null,{"$f":"IF($C105=\"\",\"\",'DV-V'!$O49)","v":""}]
[null,{"$f":"Start!$C52","v":46},{"$f":"IF(Start!$D52=\"\",\"\",Start!$D52)","v":""},{"$f":"IF(Start!$E$52=\"\",\"\",Start!$E$52)","v":""},{"$f":"IF(Start!$F$52=\"\",\"\",Start!$F$52)","v":""},{"$f":"IF($C107=\"\",\"\",IF(V.l.ZPV!$C$6=\"\",\"0\",IF(ISNA(MATCH($C107,ZPVOblN,0)),COUNTIF(ZPVOblT,\".\")+1,LOOKUP($C107,ZPVOblN,ZPVOblD))))","v":""},{"$f":"IF($C107=\"\",\"\",'PJ-V'!$J50)","v":""},{"$f":"IF($C107=\"\",\"\",LOOKUP($C107,'PJ - P'!$Y$1:$Y$50,'PJ - P'!$Z$1:$Z$50))","v":""},{"$f":"IF($C107=\"\",\"\",'DV-V'!$J50)","v":""},{"$f":"IF($C107=\"\",\"\",LOOKUP($C107,'DV - P'!$Y$1:$Y$50,'DV - P'!$Z$1:$Z$50))","v":""},{"$f":"IF($C107=\"\",\"\",TEST!$F$50)","v":""},{"$f":"IF($C107=\"\",\"\",TEST!$J$50)","v":""},null,{"$f":"IF($C107=\"\",\"\",SUM(F107,H107,J107,L107))","v":""},null,{"$f":"IF($C107=\"\",\"\",MATCH($C107,Výsledky!$K$8:$K$57,0))","v":""}]
[null,null,null,{"$f":"IF(Start!$E$52=\"\",\"\",Start!$E$52)","v":""},{"$f":"IF(Start!$F$52=\"\",\"\",Start!$F$52)","v":""},null,{"$f":"IF($C107=\"\",\"\",'PJ-V'!$O50)","v":""},null,{"$f":"IF($C107=\"\",\"\",'DV-V'!$O50)","v":""}]
[null,{"$f":"Start!$C53","v":47},{"$f":"IF(Start!$D53=\"\",\"\",Start!$D53)","v":""},{"$f":"IF(Start!$E$53=\"\",\"\",Start!$E$53)","v":""},{"$f":"IF(Start!$F$53=\"\",\"\",Start!$F$53)","v":""},{"$f":"IF($C109=\"\",\"\",IF(V.l.ZPV!$C$6=\"\",\"0\",IF(ISNA(MATCH($C109,ZPVOblN,0)),COUNTIF(ZPVOblT,\".\")+1,LOOKUP($C109,ZPVOblN,ZPVOblD))))","v":""},{"$f":"IF($C109=\"\",\"\",'PJ-V'!$J51)","v":""},{"$f":"IF($C109=\"\",\"\",LOOKUP($C109,'PJ - P'!$Y$1:$Y$50,'PJ - P'!$Z$1:$Z$50))","v":""},{"$f":"IF($C109=\"\",\"\",'DV-V'!$J51)","v":""},{"$f":"IF($C109=\"\",\"\",LOOKUP($C109,'DV - P'!$Y$1:$Y$50,'DV - P'!$Z$1:$Z$50))","v":""},{"$f":"IF($C109=\"\",\"\",TEST!$F$51)","v":""},{"$f":"IF($C109=\"\",\"\",TEST!$J$51)","v":""},null,{"$f":"IF($C109=\"\",\"\",SUM(F109,H109,J109,L109))","v":""},null,{"$f":"IF($C109=\"\",\"\",MATCH($C109,Výsledky!$K$8:$K$57,0))","v":""}]
[null,null,null,{"$f":"IF(Start!$E$53=\"\",\"\",Start!$E$53)","v":""},{"$f":"IF(Start!$F$53=\"\",\"\",Start!$F$53)","v":""},null,{"$f":"IF($C109=\"\",\"\",'PJ-V'!$O51)","v":""},null,{"$f":"IF($C109=\"\",\"\",'DV-V'!$O51)","v":""}]
[null,{"$f":"Start!$C54","v":48},{"$f":"IF(Start!$D54=\"\",\"\",Start!$D54)","v":""},{"$f":"IF(Start!$E$54=\"\",\"\",Start!$E$54)","v":""},{"$f":"IF(Start!$F$54=\"\",\"\",Start!$F$54)","v":""},{"$f":"IF($C111=\"\",\"\",IF(V.l.ZPV!$C$6=\"\",\"0\",IF(ISNA(MATCH($C111,ZPVOblN,0)),COUNTIF(ZPVOblT,\".\")+1,LOOKUP($C111,ZPVOblN,ZPVOblD))))","v":""},{"$f":"IF($C111=\"\",\"\",'PJ-V'!$J52)","v":""},{"$f":"IF($C111=\"\",\"\",LOOKUP($C111,'PJ - P'!$Y$1:$Y$50,'PJ - P'!$Z$1:$Z$50))","v":""},{"$f":"IF($C111=\"\",\"\",'DV-V'!$J52)","v":""},{"$f":"IF($C111=\"\",\"\",LOOKUP($C111,'DV - P'!$Y$1:$Y$50,'DV - P'!$Z$1:$Z$50))","v":""},{"$f":"IF($C111=\"\",\"\",TEST!$F$52)","v":""},{"$f":"IF($C111=\"\",\"\",TEST!$J$52)","v":""},null,{"$f":"IF($C111=\"\",\"\",SUM(F111,H111,J111,L111))","v":""},null,{"$f":"IF($C111=\"\",\"\",MATCH($C111,Výsledky!$K$8:$K$57,0))","v":""}]
[null,null,null,{"$f":"IF(Start!$E$54=\"\",\"\",Start!$E$54)","v":""},{"$f":"IF(Start!$F$54=\"\",\"\",Start!$F$54)","v":""},null,{"$f":"IF($C111=\"\",\"\",'PJ-V'!$O52)","v":""},null,{"$f":"IF($C111=\"\",\"\",'DV-V'!$O52)","v":""}]
[null,{"$f":"Start!$C55","v":49},{"$f":"IF(Start!$D55=\"\",\"\",Start!$D55)","v":""},{"$f":"IF(Start!$E$55=\"\",\"\",Start!$E$55)","v":""},{"$f":"IF(Start!$F$55=\"\",\"\",Start!$F$55)","v":""},{"$f":"IF($C113=\"\",\"\",IF(V.l.ZPV!$C$6=\"\",\"0\",IF(ISNA(MATCH($C113,ZPVOblN,0)),COUNTIF(ZPVOblT,\".\")+1,LOOKUP($C113,ZPVOblN,ZPVOblD))))","v":""},{"$f":"IF($C113=\"\",\"\",'PJ-V'!$J53)","v":""},{"$f":"IF($C113=\"\",\"\",LOOKUP($C113,'PJ - P'!$Y$1:$Y$50,'PJ - P'!$Z$1:$Z$50))","v":""},{"$f":"IF($C113=\"\",\"\",'DV-V'!$J53)","v":""},{"$f":"IF($C113=\"\",\"\",LOOKUP($C113,'DV - P'!$Y$1:$Y$50,'DV - P'!$Z$1:$Z$50))","v":""},{"$f":"IF($C113=\"\",\"\",TEST!$F$53)","v":""},{"$f":"IF($C113=\"\",\"\",TEST!$J$53)","v":""},null,{"$f":"IF($C113=\"\",\"\",SUM(F113,H113,J113,L113))","v":""},null,{"$f":"IF($C113=\"\",\"\",MATCH($C113,Výsledky!$K$8:$K$57,0))","v":""}]
[null,null,null,{"$f":"IF(Start!$E$55=\"\",\"\",Start!$E$55)","v":""},{"$f":"IF(Start!$F$55=\"\",\"\",Start!$F$55)","v":""},null,{"$f":"IF($C113=\"\",\"\",'PJ-V'!$O53)","v":""},null,{"$f":"IF($C113=\"\",\"\",'DV-V'!$O53)","v":""}]
[null,{"$f":"Start!$C56","v":50},{"$f":"IF(Start!$D56=\"\",\"\",Start!$D56)","v":""},{"$f":"IF(Start!$E$56=\"\",\"\",Start!$E$56)","v":""},{"$f":"IF(Start!$F$56=\"\",\"\",Start!$F$56)","v":""},{"$f":"IF($C115=\"\",\"\",IF(V.l.ZPV!$C$6=\"\",\"0\",IF(ISNA(MATCH($C115,ZPVOblN,0)),COUNTIF(ZPVOblT,\".\")+1,LOOKUP($C115,ZPVOblN,ZPVOblD))))","v":""},{"$f":"IF($C115=\"\",\"\",'PJ-V'!$J54)","v":""},{"$f":"IF($C115=\"\",\"\",LOOKUP($C115,'PJ - P'!$Y$1:$Y$50,'PJ - P'!$Z$1:$Z$50))","v":""},{"$f":"IF($C115=\"\",\"\",'DV-V'!$J54)","v":""},{"$f":"IF($C115=\"\",\"\",LOOKUP($C115,'DV - P'!$Y$1:$Y$50,'DV - P'!$Z$1:$Z$50))","v":""},{"$f":"IF($C115=\"\",\"\",TEST!$F$54)","v":""},{"$f":"IF($C115=\"\",\"\",TEST!$J$54)","v":""},null,{"$f":"IF($C115=\"\",\"\",SUM(F115,H115,J115,L115))","v":""},null,{"$f":"IF($C115=\"\",\"\",MATCH($C115,Výsledky!$K$8:$K$57,0))","v":""}]
[null,null,null,{"$f":"IF(Start!$E$56=\"\",\"\",Start!$E$56)","v":""},{"$f":"IF(Start!$F$56=\"\",\"\",Start!$F$56)","v":""},null,{"$f":"IF($C115=\"\",\"\",'PJ-V'!$O54)","v":""},null,{"$f":"IF($C115=\"\",\"\",'DV-V'!$O54)","v":""}]

{"sheet":"Pozn.","index":17,"n_rows":1,"n_cols":2,"rows_kept":1,"cut":false,"hidden":false,"merged":[[0,1,0,9]]}
[null,"Poznámky:"]

{"sheet":"List1","index":18,"n_rows":50,"n_cols":8,"rows_kept":50,"cut":false,"hidden":false,"merged":[]}
[1,null,null,{"$f":"IF(Start!$E$7=\"\",\"\",Start!$E$7)","v":"Dlažov"},{"$f":"IF(Start!$F$7=\"\",\"\",Start!$F$7)","v":"KT"},null,{"$f":"IF($C9=\"\",\"\",'PJ-V'!$J5)","v":""},{"$f":"IF($C9=\"\",\"\",'PJ-V'!$O5)","v":""}]
[2,null,null,{"$f":"IF(Start!$E$8=\"\",\"\",Start!$E$8)","v":"Brod nad Tichou"},{"$f":"IF(Start!$F$8=\"\",\"\",Start!$F$8)","v":"TA"},null,{"$f":"IF($C9=\"\",\"\",'PJ-V'!$O5)","v":""}]
[3,null,null,{"$f":"IF(Start!$E$9=\"\",\"\",Start!$E$9)","v":"Bystřice nad Úhlavou"},{"$f":"IF(Start!$F$9=\"\",\"\",Start!$F$9)","v":"KT"}]
[4,null,null,{"$f":"IF(Start!$E$10=\"\",\"\",Start!$E$10)","v":"Planá"},{"$f":"IF(Start!$F$10=\"\",\"\",Start!$F$10)","v":"TA"}]
[5,null,null,{"$f":"IF(Start!$E$11=\"\",\"\",Start!$E$11)","v":"Planá"},{"$f":"IF(Start!$F$11=\"\",\"\",Start!$F$11)","v":"TA"}]
[6,null,null,{"$f":"IF(Start!$E$12=\"\",\"\",Start!$E$12)","v":""},{"$f":"IF(Start!$F$12=\"\",\"\",Start!$F$12)","v":""}]
[7,null,null,{"$f":"IF(Start!$E$13=\"\",\"\",Start!$E$13)","v":""},{"$f":"IF(Start!$F$13=\"\",\"\",Start!$F$13)","v":""}]
[8,null,null,{"$f":"IF(Start!$E$14=\"\",\"\",Start!$E$14)","v":""},{"$f":"IF(Start!$F$14=\"\",\"\",Start!$F$14)","v":""}]
[9,null,null,{"$f":"IF(Start!$E$15=\"\",\"\",Start!$E$15)","v":""},{"$f":"IF(Start!$F$15=\"\",\"\",Start!$F$15)","v":""}]
[10,null,null,{"$f":"IF(Start!$E$16=\"\",\"\",Start!$E$16)","v":""},{"$f":"IF(Start!$F$16=\"\",\"\",Start!$F$16)","v":""}]
[11,null,null,{"$f":"IF(Start!$E$17=\"\",\"\",Start!$E$17)","v":""},{"$f":"IF(Start!$F$17=\"\",\"\",Start!$F$17)","v":""}]
[12,null,null,{"$f":"IF(Start!$E$18=\"\",\"\",Start!$E$18)","v":""},{"$f":"IF(Start!$F$18=\"\",\"\",Start!$F$18)","v":""}]
[13,null,null,{"$f":"IF(Start!$E$19=\"\",\"\",Start!$E$19)","v":""},{"$f":"IF(Start!$F$19=\"\",\"\",Start!$F$19)","v":""}]
[14,null,null,{"$f":"IF(Start!$E$20=\"\",\"\",Start!$E$20)","v":""},{"$f":"IF(Start!$F$20=\"\",\"\",Start!$F$20)","v":""}]
[15,null,null,{"$f":"IF(Start!$E$21=\"\",\"\",Start!$E$21)","v":""},{"$f":"IF(Start!$F$21=\"\",\"\",Start!$F$21)","v":""}]
[16,null,null,{"$f":"IF(Start!$E$22=\"\",\"\",Start!$E$22)","v":""},{"$f":"IF(Start!$F$22=\"\",\"\",Start!$F$22)","v":""}]
[17,null,null,{"$f":"IF(Start!$E$23=\"\",\"\",Start!$E$23)","v":""},{"$f":"IF(Start!$F$23=\"\",\"\",Start!$F$23)","v":""}]
[18,null,null,{"$f":"IF(Start!$E$24=\"\",\"\",Start!$E$24)","v":""},{"$f":"IF(Start!$F$24=\"\",\"\",Start!$F$24)","v":""}]
[19,null,null,{"$f":"IF(Start!$E$25=\"\",\"\",Start!$E$25)","v":""},{"$f":"IF(Start!$F$25=\"\",\"\",Start!$F$25)","v":""}]
[20,null,null,{"$f":"IF(Start!$E$26=\"\",\"\",Start!$E$26)","v":""},{"$f":"IF(Start!$F$26=\"\",\"\",Start!$F$26)","v":""}]
[21,null,null,{"$f":"IF(Start!$E$27=\"\",\"\",Start!$E$27)","v":""},{"$f":"IF(Start!$F$27=\"\",\"\",Start!$F$27)","v":""}]
[22,null,null,{"$f":"IF(Start!$E$28=\"\",\"\",Start!$E$28)","v":""},{"$f":"IF(Start!$F$28=\"\",\"\",Start!$F$28)","v":""}]
[23,null,null,{"$f":"IF(Start!$E$29=\"\",\"\",Start!$E$29)","v":""},{"$f":"IF(Start!$F$29=\"\",\"\",Start!$F$29)","v":""}]
[24,null,null,{"$f":"IF(Start!$E$30=\"\",\"\",Start!$E$30)","v":""},{"$f":"IF(Start!$F$30=\"\",\"\",Start!$F$30)","v":""}]
[25,null,null,{"$f":"IF(Start!$E$31=\"\",\"\",Start!$E$31)","v":""},{"$f":"IF(Start!$F$31=\"\",\"\",Start!$F$31)","v":""}]
[26,null,null,{"$f":"IF(Start!$E$32=\"\",\"\",Start!$E$32)","v":""},{"$f":"IF(Start!$F$32=\"\",\"\",Start!$F$32)","v":""}]
[27,null,null,{"$f":"IF(Start!$E$33=\"\",\"\",Start!$E$33)","v":""},{"$f":"IF(Start!$F$33=\"\",\"\",Start!$F$33)","v":""}]
[28,null,null,{"$f":"IF(Start!$E$34=\"\",\"\",Start!$E$34)","v":""},{"$f":"IF(Start!$F$34=\"\",\"\",Start!$F$34)","v":""}]
[29,null,null,{"$f":"IF(Start!$E$35=\"\",\"\",Start!$E$35)","v":""},{"$f":"IF(Start!$F$35=\"\",\"\",Start!$F$35)","v":""}]
[30,null,null,{"$f":"IF(Start!$E$36=\"\",\"\",Start!$E$36)","v":""},{"$f":"IF(Start!$F$36=\"\",\"\",Start!$F$36)","v":""}]
[31,null,null,{"$f":"IF(Start!$E$37=\"\",\"\",Start!$E$37)","v":""},{"$f":"IF(Start!$F$37=\"\",\"\",Start!$F$37)","v":""}]
[32,null,null,{"$f":"IF(Start!$E$38=\"\",\"\",Start!$E$38)","v":""},{"$f":"IF(Start!$F$38=\"\",\"\",Start!$F$38)","v":""}]
[33,null,null,{"$f":"IF(Start!$E$39=\"\",\"\",Start!$E$39)","v":""},{"$f":"IF(Start!$F$39=\"\",\"\",Start!$F$39)","v":""}]
[34,null,null,{"$f":"IF(Start!$E$40=\"\",\"\",Start!$E$40)","v":""},{"$f":"IF(Start!$F$40=\"\",\"\",Start!$F$40)","v":""}]
[35,null,null,{"$f":"IF(Start!$E$41=\"\",\"\",Start!$E$41)","v":""},{"$f":"IF(Start!$F$41=\"\",\"\",Start!$F$41)","v":""}]
[36,null,null,{"$f":"IF(Start!$E$42=\"\",\"\",Start!$E$42)","v":""},{"$f":"IF(Start!$F$42=\"\",\"\",Start!$F$42)","v":""}]
[37,null,null,{"$f":"IF(Start!$E$43=\"\",\"\",Start!$E$43)","v":""},{"$f":"IF(Start!$F$43=\"\",\"\",Start!$F$43)","v":""}]
[38,null,null,{"$f":"IF(Start!$E$44=\"\",\"\",Start!$E$44)","v":""},{"$f":"IF(Start!$F$44=\"\",\"\",Start!$F$44)","v":""}]
[39,null,null,{"$f":"IF(Start!$E$45=\"\",\"\",Start!$E$45)","v":""},{"$f":"IF(Start!$F$45=\"\",\"\",Start!$F$45)","v":""}]
[40,null,null,{"$f":"IF(Start!$E$46=\"\",\"\",Start!$E$46)","v":""},{"$f":"IF(Start!$F$46=\"\",\"\",Start!$F$46)","v":""}]
[41,null,null,{"$f":"IF(Start!$E$47=\"\",\"\",Start!$E$47)","v":""},{"$f":"IF(Start!$F$47=\"\",\"\",Start!$F$47)","v":""}]
[42,null,null,{"$f":"IF(Start!$E$48=\"\",\"\",Start!$E$48)","v":""},{"$f":"IF(Start!$F$48=\"\",\"\",Start!$F$48)","v":""}]
[43,null,null,{"$f":"IF(Start!$E$49=\"\",\"\",Start!$E$49)","v":""},{"$f":"IF(Start!$F$49=\"\",\"\",Start!$F$49)","v":""}]
[44,null,null,{"$f":"IF(Start!$E$50=\"\",\"\",Start!$E$50)","v":""},{"$f":"IF(Start!$F$50=\"\",\"\",Start!$F$50)","v":""}]
[45,null,null,{"$f":"IF(Start!$E$51=\"\",\"\",Start!$E$51)","v":""},{"$f":"IF(Start!$F$51=\"\",\"\",Start!$F$51)","v":""}]
[46,null,null,{"$f":"IF(Start!$E$52=\"\",\"\",Start!$E$52)","v":""},{"$f":"IF(Start!$F$52=\"\",\"\",Start!$F$52)","v":""}]
[47,null,null,{"$f":"IF(Start!$E$53=\"\",\"\",Start!$E$53)","v":""},{"$f":"IF(Start!$F$53=\"\",\"\",Start!$F$53)","v":""}]
[48,null,null,{"$f":"IF(Start!$E$54=\"\",\"\",Start!$E$54)","v":""},{"$f":"IF(Start!$F$54=\"\",\"\",Start!$F$54)","v":""}]
[49,null,null,{"$f":"IF(Start!$E$55=\"\",\"\",Start!$E$55)","v":""},{"$f":"IF(Start!$F$55=\"\",\"\",Start!$F$55)","v":""}]
[50,null,null,{"$f":"IF(Start!$E$56=\"\",\"\",Start!$E$56)","v":""},{"$f":"IF(Start!$F$56=\"\",\"\",Start!$F$56)","v":""}]